{"text_format":"3","workbook":"xlsx","n_sheets":9,"sheets":["Cover","RevisionNotes","Instructions","FC360_Panel","C-NET_Module2","Panel_values","FDnet_Ref","FDnet_Constants","Panel_comp"],"not_rendered":{"images":78,"macros":1,"external_links":2,"defined_names":139,"comments":4},"read":"whole","date_system":"1900"}

{"sheet":"Cover","index":0,"n_rows":56,"n_cols":4,"rows_kept":56}
{"$rows_empty":22}
["FC360"]
[]
["Fire Detection System"]
[]
["FC360 - Cerberus FIT Quantities Tool"]
[]
["Version 1.4"]
{"$rows_empty":26}
[{"$nulls":3},"Smart Infrastructure"]

{"sheet":"RevisionNotes","index":1,"n_rows":71,"n_cols":1,"rows_kept":71,"hidden":true}
["Current Version:"]
[]
["A6V10211118_f_en_--_FX7210-QuantitiesTool.xls  (25. June 2010)"]
[]
["  Martin Luethi <martin.luethi@siemens.com>"]
[]
["- changelog:"]
["- Changes for MP3.0"]
["- add FC726-ZA with CardCage5 with Linecard FCL2001 (C-NET) and FCI2008 (I/O-programmable)"]
["- add new external supply output1 and 2 row for Scalance X204-2 / S612"]
["- C-NET changes and correction:"]
["- add new C-NET device FDCAI221 (Adressable alarm indicator)"]
["- add new wirless C-NET device DOW1171, SMF6120 and FDCW22"]
["- change name from C-NET device \"DJ119x\" to \"DJ119x/FDAI9x\""]
["- change C-NETTK from FDCL221-M - Multi line isolator from 1 to 9"]
["- correct max. amount check on C-NET Terminals  "]
["- reduce capacity from FA2009-A1 battery from 110Ah to 100Ah"]
[]
["History"]
[]
["A6V10211118_e_en_--_FX7210-QuantitiesTool.xls  (18. November 2009)"]
[]
["  Martin Luethi <martin.luethi@siemens.com>"]
[]
["- changelog:"]
["- Changes for Office 2007 adaptation (some commands are not identical with office 2003)"]
["- activate sheet command is necessary before a …select command"]
["- rename sheets after copy sheets with index-reference (copied sheet is not active as in office 2003)"]
["- copy formula from FDnet_Calc_Ref to FDnet_Constants"]
["- Do not show working on screen with command \"ScreenUpdating\""]
[]
["A6V10211118_d_en_--_FX7210-QuantitiesTool.xls  (2. July 2009)"]
[]
["  Martin Luethi <martin.luethi@siemens.com>"]
[]
["- changelog:"]
["- Delete Missing VISXDATA 1.0 in VBA References"]
["- change macros name from german to english (BeiKlick - ByClick, BeiAenderung - ByChange)"]
[]
["A6V10211118_c_en_--_FX7210-QuantitiesTool.xls  (24. April 2009)"]
[]
["  Martin Luethi <martin.luethi@siemens.com>"]
[]
["- changelog:"]
["- CRs FSP00067214"]
["- rename FDCL221 and FDCL221-M on sheets Fdnet_Ref and Fdnet_Calc_Ref"]
["- remove FDBZ292 - Air Sampling  on sheets Fdnet_Ref and Fdnet_Calc_Ref"]
["- Reference for C-Net devices: 704-006-004_FS_Peripheral_Panel_Compatibility / Rev. 32"]
[]
[]
["A6V10211118_b_en_--_FX7210-QuantitiesTool.xls  (17. March 2009)"]
[]
["  Martin Luethi <martin.luethi@siemens.com>"]
[]
["- changelog:"]
["- impact through new generating of additional sheets"]
["- excel supported with visual basic script"]
["- dependent on the selected station, additonal sheets are generated"]
["- updated \"FDnet_Ref\" and \"FDnet_Calc_Ref\" sheets with INDIRECT links, reference for copy"]
["- new \"FDnet Constants\" sheet for FDnet constants definition"]
["- Updating \"Fx20xx_Panel and \"Panel_comp\" sheets for generated sheets"]
["- CRs FSP00065588, FSP00065587, FSP00065589"]
["- Rename visible names from Fdnet to C-NET"]
[]
[]
["A6V10211118_a_en_--_FX7210-QuantitiesTool.xls  (14. November 2008)"]
[]
["  Martin Luethi <martin.luethi@siemens.com>"]
[]
["- changelog:"]
["    - New compilation from 009716_e_en_--_FX2010-SintesoQuantitiesTool.xls"]

{"sheet":"Instructions","index":2,"n_rows":358,"n_cols":1,"rows_kept":358}
["Instruction of planning of FC360 fire control panel"]
[]
["General information:"]
["The project planning of an FC360 fire control panel can be performed completely with this tool."]
[]
["Purpose:"]
["With the project planning of the fire control panel, loads of the fire control panel, line card and necessary batteries are verified. This results in the definite ordering."]
["This instruction includes two parts: planning of the panel load and planning of the detection line, which correspond to the two sheets \"FC360_Panel\" and \"C-NET _Module2\" respectively."]
[]
["Part 1. Planning of the panel load"]
["This part intends to give an instruction on how to fill out sheet 'FC360_Panel' step by step."]
["Step 1. Panel selection"]
{"$rows_empty":10}
["(1) Panel selection"]
["Panel type is 'FC361' or 'FC362'. \nFor FC361, FC361-ZZ and FC361-ZA can be selected.\nFor FC362, FC362-ZZ and FC362-ZA can be selected.\nFor more information about panel types, see document A6V10421795 (http://www.siemens.com/download?A6V10421795)."]
["(2) Field devices"]
["C-NET Module2\nHere shows the power consumed by C-NET which comes from sheet 'C-NET_Module2'. "]
[]
["Step 2. Filling outputs of mainboard"]
["Mainboard outputs include auxiliary power load and loads of the two sounder lines."]
{"$rows_empty":9}
["(1) Sounder lines"]
["2 sounder lines are provided. Each sounder line has an output limitation of 0.5 A. The total output of the two sounder lines shall not be greater than 0.5 A."]
["Cell changes to orange if,\no Value is greater than 0.5A.\no Summed value of the two sounder lines is greater than 0.5 A."]
[]
["(2) Auxiliary power"]
["Basically auxiliary power is used to provide power to external devices. The maximum capacity is 0.2 A."]
["Cell changes to orange if\no Value is greater than 0.2A"]
[]
["Step 3. Filling options"]
{"$rows_empty":11}
["(1) Permanent Ethernet connection"]
["If a permanent Ethernet connection is used, select \"YES\", otherwise select \"NO\"."]
[]
["(2) RS Module"]
["RS module can be RS232 module or RS485 module. \"No module\" means no RS232 or RS485 module is equipped."]
[]
["(3) PMI-Options"]
["The options can be LED indicator (32 zones), Evacuation module (NL) or No module."]
[]
["(4) Output card (4M)"]
["Output card (4M)\nOutput card (4M) equipped or not. If no, sub options are collapsed.  "]
["Power supply of Output card (4M)\nWhen Output card (4M) is equipped, it can be powered by external power supply or internal power supply. If it's powered externally, sub options are collapsed."]
[]
[]
["Outputs of Output card (4M)\nIf Output card (4M) is powered internally, configure 4 outputs here."]
["Each output can be configured as Fire control, RT Fault, RT Fire or Sounder line. \nInput load in quiescent condition but set value in alarm condition to 0 if an output is configured as RT Fault. Otherwise, input load in alarm condition but set value in quiescent condition to 0."]
["Note that output voltage of output card is DC 26 V. "]
[]
[]
["Step 4. Panel and Supply & battery check"]
{"$rows_empty":26}
["(1) Battery required standby-time"]
["Input required standby-time and alarm-time (after standby). Battery calculation depends on data input here."]
[]
["(2) Battery calculation"]
["Required battery\nIt is the required battery capacity which is calculated by data input above. Calculation formula is as follows,"]
[]
[]
["security_factor: for no more than 24-h standby, security_factor is 1.25; for more than 24-h standby, security_factor is 1."]
["Available batteries\nIt's the battery which matches the panel or has a bigger capacity than required."]
["Cell changes to red if\n£ No appropriate battery is available."]
[]
["(3) Supply calculation"]
["Maximal current of power supply\nRequired load of power supply by calculation. It equals required current of power supply multiplied by voltage DC 24 V."]
["Required supply\nRequired load of power supply by calculation. It equals required current of power supply multiplied by voltage 24 Vdc."]
["Integrated supply\nDefault power supply in panel."]
["Available supply\nIf no available power supply meets the requirement (capacity is bigger than the required load), \"--\" is shown. Otherwise it shows the capacity and power supply type."]
["Cell changes to red if\n£ No appropriate power supply is available."]
[]
["(4) Configuration result"]
["It shows if the configuration has passed the check."]
[]
[]
["Part 2. Planning of detection line"]
["Planning of the detection line is implemented in sheet \"C-NET_Module2\"."]
["Procedure:"]
["Step 1: Input number of devices."]
[]
[]
[]
["1.1 Choose correct Alarm indicator extras "]
["--> None: At Alarm state Indicator flashing every 1s (10 Internal and 10 External AI's)"]
["--> Steady ON: At alarm state Indicator Steady ON (32 AI's)"]
["--> Operation Indicator: At Quiet state Indicator flashing every 1s (All AI's), at Alarm state Steady ON (10 AI's)"]
[]
["1.2  Device population"]
["Click the dropdown arrow under TRUE, select the detection line type, loop or stub. Default is 'Loop'. When ‘Stub’ is selected, two stubs are displayed."]
[]
[]
[]
[]
["1.3 Enter the number of devices per loop / stub in the table"]
["Click on \"+\" on the left column of each type of devices to spread out devices list and enter the number of devices per loop / stub"]
["Devices type: Point detectors; Special detectors; Manual call points; Line modules; Alarm devices - Sound; Alarm devices -  Sound and Voice; Alarm devices -  Sound and Light (Beacon); Alarm devices - Sound and Voice and Light (Beacon) and Operation and indication devices"]
{"$rows_empty":20}
["Reminders:\no  Number of FT2010 or FT2011: Max. 4 is recommended due to its heavier load.\no Summed number of FT2010 and FT2011 devices: Max. 4."]
[]
["Step 2. Input cable characteristics"]
[]
["2.1 Cable characteristics"]
["Click the dropdown arrow of optional frame, select detection line cable type. Default is 'Enter cable parameter manually'. "]
["Define four parameters here: Cable length for line resistor, Cable length for line capacity, Resistance value R' of cable and Capacitance value Cs' of cable. If one specific type of cable is selected, R' and Cs' will be automatically filled out. \nAppendix A shows examples of other different cable types."]
[]
[]
[]
[]
[]
[]
["(1) Cable length for line resistor"]
["Length of line resistor is calculated from each loop connection to the farthest detector. See graph below."]
{"$rows_empty":17}
["Two values are calculated. One is from Loop1-A, while the other one is from Loop1-B. The bigger one is used as length of line resistor."]
["Cell changes to orange if,\no Length for line resistor is greater than 3300 m.\no Length for line resistor is greater than the length for line capacity."]
[]
["(2) Cable length for line capacity"]
["To determine the length for line capacity, the following cable lengths must be added: \no Total loop length. \no Length of all stub lines.\no Length of all cables to all external alarm indicators. \no Length of all cables to external circuits (e.g. fire controls). "]
{"$rows_empty":18}
["Total length of all cables is the length for line capacity."]
["Cell changes to orange if,\no Length for line capacity is greater than 5000 m.\no Length for line resistor is greater than length for line capacity."]
[]
["(3) Resistance value R' of cable"]
["Depending on the cable type, R' can be the cable resistance per km (Ω/km). This corresponds to the resistance value for both cable conductor strings. If R' is unknown,  it can be calculated with the following formula:"]
[]
[]
[]
[]
[]
["Where,\nρ (rho)   Specific electrical resistance for copper (constant: 0.0178 Ωmm/m)\n2000      2 km in m (both conductors for 1 km cable).\nA          Cable cross-section [mm 2 ]. "]
[]
["(4) Capacitance value Cs' of cable"]
["Cs' is the capacitance per km between one conductor and the other conductor connected to the first one across the shield.\nCp' is the capacitance between the two conductors per km. The cable manufacturer usually states the capacity Cp'."]
["For unshielded cables, "]
[]
[]
["For shielded cables, if only Cp' is known, but not Cs', the following rule of thumb is used,"]
[]
[]
[]
["2.2 Calculation characteristics"]
[]
["Choose calculation characteristics"]
["--> Worst case: All devices are placed at end of line for calculation."]
["--> Equally: All devices are distributed equally over cable length. Possibility to add extra start and end cable length."]
{"$rows_empty":8}
["(1) \"Worst case\" calculation"]
["Used if:\nYou want to be sure that function is guaranteed for all device distribution.\nLimitation:\n- Stub on Loop (except capacity calculation)."]
{"$rows_empty":14}
["(2) \"Equally\" calculation"]
["Used if:\n- Devices are distributed nearly equal over loop.\n    Attention: Loop function is not guaranteed if distribution is unequal.\n- Possibility to add start and end length without devices.\nLimitation:\n- Stub on Loop (except capacity calculation)."]
{"$rows_empty":14}
["Step 3. Check the analysis of configuration"]
["After steps 1~2, click button \" Press Button to refresh calculation\" on the top or bottom and the tool gives an analysis in accordance with the inputted data as follows."]
["If any cell changes to red, it means overrun. "]
{"$rows_empty":18}
["(1) Device information"]
["Addressindex (AK) per loop/stub\nNumber of bus addresses used by devices on a loop or stub  (including sub-addresses)."]
["Total Adressindex (AK) per Line Card\nNumber of bus addresses used by devices on all loops and stubs  (including sub-addresses)."]
["Cell changes to red if,\no Value > 126"]
[]
["(2) Alarm calculation"]
[]
["Maximum alarm current per Line Card\nThe total alarm current of detective lines in alarm state on all loops and stubs"]
["Total alarm current per Line Card\nThe total alarm current of detective lines in alarm state on a loop or stub"]
["Current consumption alarm (at Panel by 24V)\nTotal consumption alarm current on panel 24V power supply"]
["Cell changes to red if,\no Value of total alarm current larger than Maximum alarm current"]
[]
[]
["(3) Quiet calculation"]
[]
[]
[]
[]
[]
[]
["(4) Cabling information"]
[]
["Resistor load per Loop / Stub\nCurrent wire resistor based on 'Length for line resistor' and 'Resistance value R' of cable' in step 2."]
[]
["Additional possible resistor load per Loop / Stub (approximate estimate, dRmax)\nExcept planning cable, the additional possible cable resistance would be allowed."]
["Additional possible cable length per Loop / Stub (approximate estimate)\nExcept planning cable length, the additional possible cable length would be allowed."]
["Cell changes to red with deviation value if,\no Value is less than application needs."]
[]
["Maximum line capacitive per Loop / Stub\nAllowable maximum line capacity per loop/stub."]
["Cable capacitive per Loop / Stub\nCurrent wire capacity based on 'Cable length for line capacity' and 'Capacitance value Cs' of cable' in step 2."]
["Cell changes to red if,\no Value is greater than 'Maximum line capacitive per Loop / Stub’."]
["Maximum line capacitive per Line Card\nAllowable maximum capacity per panel. Total capacity of all loops and stubs shall not be greater than it. "]
["Total capacitive load per Line Card\nTotal capacity of all loops and stubs."]
["Cell changes to red if,\no Value is greater than ‘Maximum line capacitive per Line Card’."]
[]
["(5) Indication of result"]
["If all inputs are right, a green symbol 'Configuration valid' is shown, otherwise a red symbol 'Configuration not valid' is shown."]
{"$rows_empty":10}
["Appendix A. Cable resistance and cable capacitance"]
["The tables below show the cable resistance (R') and cable capacitance (Cs') of\ndifferent cable types. The values given are reference values and may vary from\none manufacturer to another.\nIdentical cable designations do not guarantee that the cables have the same\nvalues. They may differ depending on the manufacturer."]

{"sheet":"FC360_Panel","index":3,"n_rows":583,"n_cols":10,"rows_kept":583,"merged":[[22,1,22,5],[23,1,23,5],[24,1,24,5],[25,1,25,5],[26,1,26,5],[29,0,29,10],[76,0,76,10],[87,1,87,4],[87,5,87,6],[87,7,87,8],[90,1,90,4],[90,5,90,6],[90,7,90,8],[96,0,96,10],[98,3,98,4],[98,5,98,6],[98,7,98,8],[99,9,100,9],[102,3,102,4],[102,5,102,6],[102,7,102,8],[106,3,106,4],[106,5,106,6],[106,7,106,8],[114,3,114,4],[114,5,114,6],[114,7,114,8],[115,9,120,9],[128,0,128,10],[130,3,130,4],[130,5,130,6],[130,7,130,8],[135,3,135,4],[135,5,135,6],[135,7,135,8],[136,3,136,4],[137,3,137,4],[140,3,140,4],[140,5,140,6],[140,7,140,8],[144,3,144,4],[144,5,144,6],[144,7,144,8],[154,3,154,4],[154,5,154,6],[154,7,154,8],[155,3,155,4],[157,3,157,4],[157,5,157,6],[157,7,157,8],[158,3,158,4],[159,3,159,4],[160,3,160,4],[160,5,160,6],[160,7,160,8],[161,3,161,4],[161,9,164,9],[162,3,162,4],[163,3,163,4],[164,3,164,4],[165,3,165,4],[165,5,165,6],[165,7,165,8],[166,3,166,4],[201,3,201,4],[201,5,201,6],[201,7,201,8],[215,0,215,10],[217,3,217,4],[217,5,217,6],[217,7,217,8],[220,0,220,10],[222,3,222,4],[222,5,222,6],[222,7,222,8],[226,3,226,4],[226,5,226,6],[226,7,226,8],[234,3,234,4],[234,5,234,6],[234,7,234,8],[239,3,239,4],[239,5,239,6],[239,7,239,8],[254,9,261,9]]}
[null,"Planning of an FC360 Fire Control Panel"]
[]
[null,"Purpose:"]
[null,"With the project planning of the fire control panel the load of the fire control panel and the necessary batteries are verified. This results in the definite:"]
[null,"- type of fire control panel."]
[null,"- type of batteries and power supply."]
[null,"Procedure:"]
[null,"1) Choose panel FC361 or FC362."]
[null,"2) Choose panel variant."]
[null,"3) Fill out C-NET_Module2 and get green 'Configuration valid'"]
[null,"4) Enter other loads from outputs and options."]
[null,"5) Enter required stand-by time."]
[null,"6) The program calculates the result automatically after you enter or update any parameter."]
[null,"--> The program calculates the necessary batteries and the necessary power supply."]
[null,"--> The program gives you a hint, whether…"]
[null,"… batteries fit in the chosen panel variant or additional housings must be ordered."]
[null,"… power supply is integrated in the chosen panel variant or additional supplies must be ordered."]
[null,"--> The panel configuration must be 'Configuration ok' with green thumb and smile face before continuing."]
[]
[null,"Please consider:"]
[]
[]
[null,"yellow fields, Must be filled in by the user."]
[null,"orange fields, Shows an input data error. These fields must be filled in by the user."]
[null,"light green fields, Calculated value, additional information for the user. Field must not be changed by the user."]
[null,"green fields, Calculated value, configuration valid. Field must not be changed by the user."]
[null,"red fields, Calculated value, configuration invalid. Field must not be changed by the user."]
[]
[]
["Panel selection"]
[null,"Help values"]
[{"$nulls":4},"Selection Panel Type"]
[{"$nulls":3},1,"FC361",null,{"$f":"Panel_values!M3","v":4},"Variants"]
[{"$nulls":3},2,"FC362",null,{"$f":"Panel_values!M4","v":4},"Variants"]
[{"$nulls":3},3,null,null,{"$f":"Panel_values!M5","v":3},"Variants"]
[{"$nulls":3},4,null,null,{"$f":"Panel_values!M6","v":1},"Variants"]
[{"$nulls":3},5,null,null,{"$f":"Panel_values!M7","v":2},"Variants"]
[{"$nulls":3},6,null,null,{"$f":"Panel_values!M8","v":0},"Variants"]
[]
[]
[{"$nulls":4},1,null,"(Panel-type, # of row in tables on sheet \"Panel_values\")"]
[]
[{"$nulls":4},"Selection Panel Variant"]
[{"$nulls":3},1,{"$f":"VLOOKUP($E$41,Panel_values!$A$3:$L$8,2)","v":"FC361-ZZ"}]
[{"$nulls":3},2,{"$f":"VLOOKUP($E$41,Panel_values!$A$3:$L$8,3)","v":"FC361-ZA"}]
[{"$nulls":3},3,{"$f":"VLOOKUP($E$41,Panel_values!$A$3:$L$8,4)","v":"FC361-YZ"},null,null,"Amount CardCage2",0]
[{"$nulls":3},4,{"$f":"VLOOKUP($E$41,Panel_values!$A$3:$L$8,5)","v":"FC361-YA"},null,null,"Amount CardCage5",0]
[{"$nulls":3},5,{"$f":"VLOOKUP($E$41,Panel_values!$A$3:$L$8,6)","v":"--"}]
[{"$nulls":3},6,{"$f":"VLOOKUP($E$41,Panel_values!$A$3:$L$8,7)","v":"--"},null,null,"ActualStationType",1]
[{"$nulls":3},7,{"$f":"VLOOKUP($E$41,Panel_values!$A$3:$L$8,8)","v":"--"}]
[{"$nulls":3},8,{"$f":"VLOOKUP($E$41,Panel_values!$A$3:$L$8,9)","v":"--"},null,null,"Mask PeriBoard4",{"$f":"IF(E41=5,1,0)","v":0},"(Feauters on Peri2)"]
[{"$nulls":3},9,{"$f":"VLOOKUP($E$41,Panel_values!$A$3:$L$8,10)","v":"--"},null,null,"Mask PeriBoard2+4",{"$f":"IF(OR(E41=1,E41=2,E41=5),1,0)","v":1},"(Feauters on Peri2 and Peri4)"]
[{"$nulls":3},10,{"$f":"VLOOKUP($E$41,Panel_values!$A$3:$L$8,11)","v":"--"}]
[{"$nulls":3},11,{"$f":"VLOOKUP($E$41,Panel_values!$A$3:$L$8,12)","v":"--"}]
[]
[{"$nulls":4},1,null,"(Panel-variant, # of coloum in tables on sheet \"Panel_values\")"]
[]
[null,"Panel selection"]
[]
[]
[null,"Panel characteristics:"]
[null,"Panel type:",{"$f":"Panel_comp!B109","v":"FC361-ZZ"}]
[null,{"$f":"CONCATENATE(\"Variant: \",VLOOKUP($E$41,Panel_values!A22:L27,_xlfn.SINGLE($E$56)+1,FALSE))","v":"Variant: International"}]
[null,{"$f":"CONCATENATE(\"Order Number: \",VLOOKUP($E$41,Panel_values!A13:L18,_xlfn.SINGLE($E$56)+1,FALSE))","v":"Order Number: S54433-C112-A1"}]
[null,"C-NET:",null,{"$f":"Panel_comp!C110","v":1},{"$f":"Panel_comp!D110","v":"loops"}]
[null,"Card cage type:",{"$f":"Panel_comp!B111","v":"--"},{"$f":"Panel_comp!C111","v":""},{"$f":"Panel_comp!D111","v":""}]
[null,"Housing type:",{"$f":"Panel_comp!C173","v":"Compact"}]
[null,"Supply type:",{"$f":"Panel_comp!B182","v":"FP2001-A1"},{"$f":"Panel_comp!C182","v":70},"W"]
[null,"Max. fitting batteries:",{"$f":"Panel_comp!B174","v":"FA2004-A1"},{"$f":"Panel_comp!C174","v":12},"Ah"]
[null,"Max. fitting power supply:",{"$f":"Panel_comp!B185","v":"FP2001-A1"},{"$f":"Panel_comp!C185","v":70},"W"]
[]
[]
[]
[]
[]
[]
["Field devices"]
[]
[]
[]
[]
[null,{"$f":"Panel_comp!A14","v":"Max. Total Current of All Sounders"},{"$nulls":3},{"$f":"Panel_comp!C14","v":{"v":0.5,"d":"0.500"}},{"$f":"Panel_comp!D14","v":"A"},{"$f":"Panel_comp!E14","v":"(@ 24V)"}]
[null,{"$f":"Panel_comp!A15","v":"Max. Current per Sounder Line"},{"$nulls":3},{"$f":"Panel_comp!C15","v":{"v":0.5,"d":"0.500"}},{"$f":"Panel_comp!D15","v":"A"},{"$f":"Panel_comp!E15","v":"(@ 24V)"}]
[null,{"$f":"Panel_comp!A16","v":"Max. Current of Auxiliary Power"},{"$nulls":3},{"$f":"Panel_comp!C16","v":{"v":0.2,"d":"0.200"}},{"$f":"Panel_comp!D16","v":"A"},{"$f":"Panel_comp!E16","v":"(@ 24V)"}]
[null,{"$f":"Panel_comp!A17","v":"Max. Current per Open Collector"},{"$nulls":3},{"$f":"Panel_comp!C17","v":{"v":0.1,"d":"0.100"}},{"$f":"Panel_comp!D17","v":"A"},{"$f":"Panel_comp!E17","v":"(@ 24V)"}]
[null,{"$f":"Panel_comp!A18","v":"Max. RSxxx Modules"},{"$nulls":3},{"$f":"Panel_comp!C18","v":1},{"$f":"Panel_comp!D18","v":"pcs."},{"$f":"Panel_comp!E18","v":0}]
[]
[null,"C-NET module2",{"$nulls":3},"Quiescent current",null,"Alarm current",null,"Remarks"]
[null,"Current consumption (at panel by 24V)",{"$nulls":3},{"$f":"'C-NET_Module2'!C548","v":0.039},"A",{"$f":"'C-NET_Module2'!C538","v":0.039},"A","Values from \"C-NET_Module2\""]
[]
[null,"C-NET Module3",{"$nulls":3},{"$f":"F$88","v":"Quiescent current"},null,{"$f":"H$88","v":"Alarm current"},null,{"$f":"J$88","v":"Remarks"}]
[null,"Current consumption (at panel by 24V)",{"$nulls":3},{"v":0.0390123564023536,"d":"0.039"},"A",{"v":0.0390123564023536,"d":"0.039"},"A","Values from \"C-NET_Module3\""]
[]
[]
[]
[]
["Outputs of main board"]
[]
[null,"Sounder lines",{"$nulls":5},{"$f":"H$88","v":"Alarm current"},null,{"$f":"J$88","v":"Remarks"}]
[null,"Sounder line 1 (SOUND1)",{"$nulls":5},{"v":0,"d":"0.000"},"A","Load of each sounder line shall not be greater than 0.5 A.\nTotal sounder load shall not be greater than 0.5 A."]
[null,"Sounder line 2 (SOUND2)",{"$nulls":5},{"v":0,"d":"0.000"},"A"]
[]
[null,"Alarm & Fault Outputs",{"$nulls":3},{"$f":"F$88","v":"Quiescent current"},null,{"$f":"H$88","v":"Alarm current"},null,{"$f":"J$88","v":"Remarks"}]
[null,"Load on \"Output Alarm supervised\" (AL_OUT)",{"$nulls":7},"·"]
[null,"Load on \"Output Fault supervised\" (FAU_OUT)"]
[]
[null,"Auxiliary power",{"$nulls":3},{"$f":"F$88","v":"Quiescent current"},null,{"$f":"H$88","v":"Alarm current"},null,"Remarks"]
[null,"Total load of auxiliary power",{"$nulls":3},{"v":0,"d":"0.000"},"A",{"v":0,"d":"0.000"},"A","Total load of auxiliary power shall not be greater than 0.2 A."]
[null,"Load on \"Configurable I/Os\" (I/Ox)",{"$nulls":3},{"v":0,"d":"0.000"},"A",{"v":0,"d":"0.000"},"A"]
[null,"Load for external dialer",{"$nulls":3},{"v":0,"d":"0.000"},"A",{"v":0,"d":"0.000"},"A"]
[]
[]
[{"$nulls":7},{"v":0,"d":"0.000"}]
[]
[{"$nulls":5},{"$f":"F$88","v":"Quiescent current"},null,{"$f":"H$88","v":"Alarm current"}]
{"$rows_empty":7}
[null,"Input Checks Sounder Line 1",null,{"$f":"IF(OR(H$100>F$83,AND(H$100>0, H$100+H$101>F$82)),0,1)","v":1}]
[null,"Input Checks Sounder Line 2",null,{"$f":"IF(OR(H$101>F$83,AND(H$101>0, H$100+H$101>F$82)),0,1)","v":1}]
[null,"Input Checks Alarm & Fault Outputs",null,{"$f":"IF(OR($E$41=5,AND(F104<=F85,H104<=F85,F105<=F85,H105<=F85)),1,0)","v":1}]
[null,"Input Checks Ext. Supply Output 1",null,{"$f":"IF(OR($E$41=5,AND(F126<=F84,H126<=F84)),1,0)","v":1},null,{"$f":"SUM(F108:F113)","v":{"v":0,"d":"0.000"}},"A",{"$f":"SUM(H108:H113)","v":{"v":0,"d":"0.000"}},"A"]
[null,"Input Checks Ext. Supply Output 2",null,{"$f":"IF(OR($E$41=1,$E$41=5,AND(F127<=F84,H127<=F84)),1,0)","v":1},null,{"$f":"SUM(F116:F121)","v":{"v":0,"d":"0.000"}},"A",{"$f":"SUM(H116:H121)","v":{"v":0,"d":"0.000"}},"A"]
[]
["Options"]
[]
[null,"Networking",null,"Quantity",null,"Quiescent power",null,"Alarm power",null,{"$f":"J$88","v":"Remarks"}]
[{"$nulls":4},"pcs",{"$f":"Panel_comp!L74+Panel_comp!L75","v":{"v":0,"d":"0.00"}},"W",{"$f":"Panel_comp!M74+Panel_comp!M75","v":{"v":0,"d":"0.00"}},"W"]
[{"$nulls":4},"pcs",{"$f":"Panel_comp!L76","v":{"v":0,"d":"0.00"}},"W",{"$f":"Panel_comp!M76","v":{"v":0,"d":"0.00"}},"W"]
[{"$nulls":4},"pcs",{"$f":"Panel_comp!L77","v":{"v":0,"d":"0.00"}},"W",{"$f":"Panel_comp!M77","v":{"v":0,"d":"0.00"}},"W"]
[]
[null,"Communication",null,"Option",null,{"$f":"F$131","v":"Quiescent power"},null,{"$f":"H$131","v":"Alarm power"},null,{"$f":"J$88","v":"Remarks"}]
[null,"Permanent Ethernet connection",null,"NO",null,{"$f":"Panel_comp!L80","v":{"v":0,"d":"0.00"}},"W",{"$f":"Panel_comp!M80","v":{"v":0,"d":"0.00"}},"W","Only if used in the operation mode in the panel."]
[null,"RS module (isolated)",{"$f":"VLOOKUP(D138,Panel_comp!A81:B83,2)","v":"-"},"No module",null,{"$f":"VLOOKUP(D138,Panel_comp!A81:M83,12)","v":{"v":0,"d":"0.00"}},"W",{"$f":"VLOOKUP(D138,Panel_comp!A81:M83,13)","v":{"v":0,"d":"0.00"}},"W"]
[]
[]
[null,"Printer",null,{"$f":"D131","v":"Quantity"},null,{"$f":"F$88","v":"Quiescent current"},null,{"$f":"H$88","v":"Alarm current"},null,{"$f":"J$88","v":"Remarks"}]
[{"$nulls":3},0,"pcs",{"v":0.05,"d":"0.050"},"A",{"v":0.06,"d":"0.060"},"A","If used: current= 50…100mA, depending on printing frequency."]
[{"$nulls":9},"1 RS232 Modul required additionaly"]
[]
[null,"Fire department periphery module",null,{"$f":"D131","v":"Quantity"},null,{"$f":"F$88","v":"Quiescent current"},null,{"$f":"H$88","v":"Alarm current"},null,{"$f":"J$88","v":"Remarks"}]
[null,"Fire department periphery module",null,0,"pcs",{"$f":"Panel_comp!J88","v":{"v":0,"d":"0.000"}},"A",{"$f":"Panel_comp!K88","v":{"v":0,"d":"0.000"}},"A"]
[null,"FBF",{"$nulls":3},{"v":0,"d":"0.000"},"A",{"v":0,"d":"0.000"},"A"]
[null,"UeE",{"$nulls":3},{"v":0,"d":"0.000"},"A",{"v":0,"d":"0.000"},"A"]
[null,"FSD",{"$nulls":3},{"v":0,"d":"0.000"},"A",{"v":0,"d":"0.000"},"A"]
[null,"Kennleuchte",{"$nulls":3},{"v":0,"d":"0.000"},"A",{"v":0,"d":"0.000"},"A"]
[null,"FSE",{"$nulls":3},{"v":0,"d":"0.000"},"A",{"v":0,"d":"0.000"},"A"]
[null,"FAT",{"$nulls":3},{"v":0,"d":"0.000"},"A",{"v":0,"d":"0.000"},"A"]
[null,"OeA",{"$nulls":3},{"v":0,"d":"0.000"},"A",{"v":0,"d":"0.000"},"A"]
[]
[null,"PMI-options",null,"Option",null,{"$f":"F$131","v":"Quiescent power"},null,{"$f":"H$131","v":"Alarm power"},null,{"$f":"J$88","v":"Remarks"}]
[null,{"$f":"D156","v":"No module"},{"$f":"VLOOKUP(D156,Panel_comp!A97:B99,2,0)","v":"-"},"No module",null,{"$f":"VLOOKUP(D156,Panel_comp!A97:M99,12,0)","v":{"v":0,"d":"0.00"}},"W",{"$f":"VLOOKUP(D156,Panel_comp!A97:M99,13,0)","v":{"v":0,"d":"0.00"}},"W",{"$f":"VLOOKUP(D156,Panel_comp!A97:O99,15,0)","v":"-"}]
[]
[null,{"$f":"Panel_comp!A100","v":"Output card (4M)"},null,"Option",null,{"$f":"F136","v":"Quiescent power"},null,{"$f":"H136","v":"Alarm power"},null,{"$f":"J136","v":"Remarks"}]
[null,{"$f":"Panel_comp!A101","v":"Output card (4M)"},{"$f":"IF(D159=\"YES\",Panel_comp!B101,\"-\")","v":"-"},"NO",null,{"$f":"Panel_comp!L101","v":{"v":0,"d":"0.00"}},"W",{"$f":"Panel_comp!M101","v":{"v":0,"d":"0.00"}},"W","Whether Output card (4M) equipped or not"]
[null,"Power supply of output card (4M)",null,"Internal",{"$nulls":5},"Output card (4M) powered by internal or external power supply"]
[null,"Outputs of output card (4M)",null,"Internal",null,{"$f":"F136","v":"Quiescent power"},null,{"$f":"H136","v":"Alarm power"},null,"Remarks"]
[null,"Output 1",null,"RT-Fault",null,{"v":0,"d":"0.000"},"A",{"v":0,"d":"0.000"},"A","Each output load shall not be greater than 1A.\nTotal load of 4 outputs shall not be greater than 2A."]
[null,"Output 2",null,"RT-Fire",null,{"v":0,"d":"0.000"},"A",{"v":0,"d":"0.000"},"A"]
[null,"Output 3",null,"Fire Control",null,{"v":0,"d":"0.000"},"A",{"v":0,"d":"0.000"},"A"]
[null,"Output 4",null,"Sounder Line",null,{"v":0,"d":"0.000"},"A",{"v":0,"d":"0.000"},"A"]
[]
[]
[]
[]
[null,"Max. Current of Total Outputs - Internal power",{"$nulls":3},2,"A",2,"A"]
[null,"Abbreviations",{"$nulls":3},{"$f":"Panel_comp!C21","v":1},"A",{"$f":"Panel_comp!C21","v":1},"A"]
[]
[]
[null,"Output Card",null,{"$f":"VLOOKUP(D159,B175:D176,3,FALSE)","v":0},null,{"$f":"Panel_comp!L101","v":{"v":0,"d":"0.00"}},"W",{"$f":"Panel_comp!M101","v":{"v":0,"d":"0.00"}},"W"]
[null,"NO",null,0]
[null,"YES",null,1]
[]
[]
[null,"Power supply of Output Card",null,{"$f":"VLOOKUP(D160,B180:D181,3,FALSE)","v":1}]
[null,"Internal",null,1]
[null,"External",null,0]
[]
[]
[null,"Output setting"]
[null,"Fire Control"]
[null,"RT-Fault"]
[null,"RT-Fire"]
[null,"Sounder Line"]
[]
[]
[null,"Input Checks Output Card",null,{"$f":"IF(OR(D174=0, D179=0), 1, IF(AND(Panel_comp!I101=1, D192, D193, D194, D195), 1, 0))","v":1},null,{"$f":"SUM(F162:F165)","v":{"v":0,"d":"0.000"}},null,{"$f":"SUM(H162:H165)","v":{"v":0,"d":"0.000"}}]
[null,"Input Checks Output 1",null,{"$f":"F192*H192","v":1},null,{"$f":"IF(OR(F162>F$171, F$191+H$191>F$170, AND(D162<>\"RT-Fault\",F162>0)), 0, 1)","v":1},null,{"$f":"IF(OR(H162>H$171, F$191+H$191>H$170, AND(D162=\"RT-Fault\",H162>0)), 0, 1)","v":1}]
[null,"Input Checks Output 2",null,{"$f":"F193*H193","v":1},null,{"$f":"IF(OR(F163>F$171, F$191+H$191>F$170, AND(D163<>\"RT-Fault\",F163>0)), 0, 1)","v":1},null,{"$f":"IF(OR(H163>H$171, F$191+H$191>H$170, AND(D163=\"RT-Fault\",H163>0)), 0, 1)","v":1}]
[null,"Input Checks Output 3",null,{"$f":"F194*H194","v":1},null,1,null,1]
[null,"Input Checks Output 4",null,{"$f":"F195*H195","v":1},null,1,null,1]
[]
[]
[]
[null,"RT-Fault is triggered by any fault",null,{"$f":"VLOOKUP(D167, B200:D201, 3, FALSE)","v":{"$error":"#N/A"}}]
[null,"YES",null,1]
[null,"NO",null,0]
[null,"Detached-Options (supply from FS720 station)",null,{"$f":"D131","v":"Quantity"},null,{"$f":"F$131","v":"Quiescent power"},null,{"$f":"H$131","v":"Alarm power"},null,{"$f":"J$88","v":"Remarks"}]
[null,"Remote EVAC 20-zone (FCM2008-N1, 2xFTI2002-N1)",null,0,"pcs",{"v":0,"d":"0.00"},"W",{"v":0,"d":"0.00"},"W","One RS485 Modul required additionaly"]
[null,"Mimic display driver EVAC 10-zone"," FT2003-N1",0,"pcs",{"v":0,"d":"0.00"},"W",{"v":0,"d":"0.00"},"W","One RS485 Modul required additionaly"]
[]
[]
[null,"Input Checks SAFEDLINK",null,{"$f":"IF(D132<=2,1,0)","v":1}]
[null,"Input Checks Ethernet",null,{"$f":"IF(D137<>\"\",1,0)","v":1}]
[null,"Input Checks RS Modules",null,{"$f":"IF(D138<>\"\",1,0)","v":1}]
[null,"Input Checks Printer",null,{"$f":"IF(D142=1,IF(AND(F142>=G210,F142<=I210,H142>=G210,H142<=I210),1,0),1)","v":1},null,"Min. I: ",0.05,"Max. I: ",0.1]
[null,"Input Checks VDS Module",null,{"$f":"IF(D146<=1,1,0)","v":1}]
[null,"Input Checks LED indicators",null,{"$f":"IF(I212<=G212,1,0)","v":1},null,"Max. I2C: ",{"$f":"Panel_comp!C19","v":16},"Act. I2C: ",{"$f":"Panel_comp!B141","v":4}]
[null,"Input Checks EVAC 20-zone add-on",null,{"$f":"IF(I212<=G212,1,0)","v":1}]
[]
[]
["Panel"]
[]
[null,"Own consumption",{"$nulls":3},{"$f":"F$131","v":"Quiescent power"},null,{"$f":"H$131","v":"Alarm power"},null,{"$f":"J$88","v":"Remarks"}]
[null,"Panel type",{"$f":"Panel_comp!B109","v":"FC361-ZZ"},null,null,{"$f":"Panel_comp!L149","v":{"v":2.2367999999999997,"d":"2.24"}},"W",{"$f":"Panel_comp!M149","v":{"v":2.7168,"d":"2.72"}},"W"]
[]
["Supply & battery check"]
[]
[null,"Battery required standby-time",{"$nulls":3},{"$f":"F$131","v":"Quiescent power"},null,{"$f":"H$131","v":"Alarm power"},null,{"$f":"J$88","v":"Remarks"}]
[null,"Required stand-by time",null,24,"h"]
[null,"Required alarm-time (after standby)",null,0.5,"h"]
[]
[null,"Power calculation supply1",{"$nulls":3},{"$f":"F$131","v":"Quiescent power"},null,"alarm power",null,{"$f":"J$88","v":"Remarks"}]
[null,"Field devices",{"$nulls":3},{"$f":"Panel_comp!L145","v":{"v":0.9359999999999999,"d":"0.94"}},"W",{"$f":"Panel_comp!M145","v":{"v":0.9359999999999999,"d":"0.94"}},"W"]
[null,"Outputs of main board",{"$nulls":3},{"$f":"Panel_comp!L147","v":{"v":0,"d":"0.00"}},"W",{"$f":"Panel_comp!M147","v":{"v":0,"d":"0.00"}},"W"]
[null,"Options",{"$nulls":3},{"$f":"Panel_comp!L148","v":{"v":0,"d":"0.00"}},"W",{"$f":"Panel_comp!M148","v":{"v":0,"d":"0.00"}},"W"]
[null,"Panel",{"$nulls":3},{"$f":"F219","v":{"v":2.2367999999999997,"d":"2.24"}},"W",{"$f":"H219","v":{"v":2.7168,"d":"2.72"}},"W"]
[null,"Total",{"$nulls":3},{"$f":"Panel_comp!L152","v":{"v":3.1727999999999996,"d":"3.17"}},"W",{"$f":"Panel_comp!M152","v":{"v":3.6528,"d":"3.65"}},"W"]
[]
[]
[null,"Battery calculation",{"$nulls":7},{"$f":"J$88","v":"Remarks"}]
[null,"Required batteries",{"$nulls":3},{"$f":"Panel_comp!C171","v":{"v":4.061125,"d":"4.1"}},"Ah"]
[null,"Available batteries",{"$f":"Panel_comp!B172","v":"FA2003-A1"},null,null,{"$f":"Panel_comp!C172","v":7},"Ah",null,null,{"$f":"VLOOKUP(Panel_comp!C175,Panel_comp!K220:L223,2,TRUE)","v":"O.K."}]
[]
[]
[null,"Supply calculation",{"$nulls":7},{"$f":"J$88","v":"Remarks"}]
[null,"Maximal current of power supply (incl. battery current for available type)",{"$nulls":3},{"$f":"Panel_comp!C180","v":{"v":0.49541999999999997,"d":"0.50"}},"A",null,null,{"$f":"IF($D$246=0,\"Use document 008843 to calculate power supply\",\"\")","v":""}]
[null,"Required supply",{"$nulls":3},{"$f":"Panel_comp!C181","v":{"v":11.89008,"d":"11.9"}},"W"]
[null,"Integrated supply",{"$f":"Panel_comp!B182","v":"FP2001-A1"},null,null,{"$f":"Panel_comp!C182","v":70},"W",null,null,{"$f":"IF(D248=0,\"Use additional supply\",\"\")","v":""}]
[null,"Available supply",{"$nulls":3},{"$f":"Panel_comp!C183","v":70},"W",null,null,{"$f":"VLOOKUP($I$249,Panel_comp!$K$233:$L$236,2,TRUE)","v":"O.K."}]
[]
[null,"Battery check (required batt < available batt)",null,{"$f":"IF(F237=\"no\",0,IF(F236<=F237,1,0))","v":1},"1=ok, ","0-> bigger batt",null,"Batt. C. Code:",{"$f":"2*D246+D247","v":3}]
[null,"Battery check (required batt fitting in housing)",null,{"$f":"IF(F236<=$D$69,1,0)","v":1},"1=ok, ","0-> bigger hous."]
[null,"Supply check (required supp < integrated supp)",null,{"$f":"IF(F242<=F243,1,0)","v":1},"1=ok, ","0-> add. Suppl."]
[null,"Supply check (required supp < available supp)",null,{"$f":"IF(F242<=F244,1,0)","v":1},"1=ok, ","0-> bigger supp",null,"Supp. C. Code:",{"$f":"2*D249+D250","v":3}]
[null,"Supply check (required supp fitting in housing)",null,{"$f":"IF(F242<=$D$70,1,0)","v":1},"1=ok, ","0-> bigger hous."]
[]
[null,"Battery check (required batt < available batt)",null,{"$f":"IF(#REF!=\"no\",0,IF(#REF!<=#REF!,1,0))","v":{"$error":"#REF!"}},null,"0-> bigger batt"]
[null,"Supply check (required supp < integrated supp)",null,{"$f":"IF(#REF!<=#REF!,1,0)","v":{"$error":"#REF!"}},null,"0-> add. Suppl."]
[{"$nulls":9},{"$f":"IF(J255=\"KF\",\"Need refresh calculation on C-Net_Module2\",IF(J255=\"JC\",\"Configuration ok\",\"Configuration false\"))","v":"Need refresh calculation on C-Net_Module2"}]
[{"$nulls":9},{"$f":"IF('C-NET_Module2'!C576,\"KF\",IF(AND(D123,D124,D126,D127,D125,D191,D207,D208,D209,D210,D211,D212,D213,D246,D247,D248,D249,D250,'C-NET_Module2'!C578,'C-NET_Module2'!C579),\"JC\",\"LD\"))","v":"KF"}]
{"$rows_empty":7}
[{"$nulls":9},{"$f":"J254","v":"Need refresh calculation on C-Net_Module2"}]
{"$rows_empty":131}
[null,null,0]
{"$rows_empty":187}
[null,null,true]

{"sheet":"C-NET_Module2","index":4,"n_rows":584,"n_cols":32,"rows_kept":584,"merged":[[45,0,45,18],[79,2,79,17],[79,20,79,22],[79,23,79,25],[80,2,80,5],[80,6,80,9],[80,10,80,13],[80,14,80,17],[80,20,81,20],[80,21,80,22],[80,23,81,23],[80,24,80,25],[81,2,81,3],[81,4,81,5],[81,6,81,7],[81,8,81,9],[81,10,81,11],[81,12,81,13],[81,14,81,15],[81,16,81,17],[331,1,331,13],[341,2,341,3],[341,4,341,5],[341,6,341,7],[341,8,341,9],[341,10,341,11],[341,12,341,13],[341,14,341,15],[341,16,341,17],[350,1,350,13],[360,2,360,3],[360,4,360,5],[360,6,360,7],[360,8,360,9],[360,10,360,11],[360,12,360,13],[360,14,360,15],[360,16,360,17],[381,2,381,3],[381,4,381,5],[381,6,381,7],[381,8,381,9],[381,10,381,11],[381,12,381,13],[381,14,381,15],[381,16,381,17],[383,2,383,3],[383,4,383,5],[383,6,383,7],[383,8,383,9],[383,10,383,11],[383,12,383,13],[383,14,383,15],[383,16,383,17],[384,2,384,3],[384,4,384,5],[384,6,384,7],[384,8,384,9],[384,10,384,11],[384,12,384,13],[384,14,384,15],[384,16,384,17],[385,2,385,3],[385,4,385,5],[385,6,385,7],[385,8,385,9],[385,10,385,11],[385,12,385,13],[385,14,385,15],[385,16,385,17],[389,2,389,3],[389,4,389,5],[389,6,389,7],[389,8,389,9],[389,10,389,11],[389,12,389,13],[389,14,389,15],[389,16,389,17],[391,2,391,3],[391,4,391,5],[391,6,391,7],[391,8,391,9],[391,10,391,11],[391,12,391,13],[391,14,391,15],[391,16,391,17],[393,2,393,3],[393,4,393,5],[393,6,393,7],[393,8,393,9],[393,10,393,11],[393,12,393,13],[393,14,393,15],[393,16,393,17],[395,2,395,3],[395,4,395,5],[395,6,395,7],[395,8,395,9],[395,10,395,11],[395,12,395,13],[395,14,395,15],[395,16,395,17],[397,2,397,3],[397,4,397,5],[397,6,397,7],[397,8,397,9],[397,10,397,11],[397,12,397,13],[397,14,397,15],[397,16,397,17],[400,2,400,3],[400,4,400,5],[400,6,400,7],[400,8,400,9],[400,10,400,11],[400,12,400,13],[400,14,400,15],[400,16,400,17],[403,0,403,18],[405,2,405,17],[406,2,406,3],[406,4,406,5],[406,6,406,7],[406,8,406,9],[406,10,406,11],[406,12,406,13],[406,14,406,15],[406,16,406,17],[413,2,413,3],[413,4,413,5],[413,6,413,7],[413,8,413,9],[413,10,413,11],[413,12,413,13],[413,14,413,15],[413,16,413,17],[414,2,414,3],[414,4,414,5],[414,6,414,7],[414,8,414,9],[414,10,414,11],[414,12,414,13],[414,14,414,15],[414,16,414,17],[415,2,415,3],[415,4,415,5],[415,6,415,7],[415,8,415,9],[415,10,415,11],[415,12,415,13],[415,14,415,15],[415,16,415,17],[416,2,416,3],[416,4,416,5],[416,6,416,7],[416,8,416,9],[416,10,416,11],[416,12,416,13],[416,14,416,15],[416,16,416,17],[434,2,434,17],[435,2,435,5],[435,6,435,9],[435,10,435,13],[435,14,435,17],[436,2,436,3],[436,4,436,5],[436,6,436,7],[436,8,436,9],[436,10,436,11],[436,12,436,13],[436,14,436,15],[436,16,436,17],[447,2,447,3],[447,4,447,5],[447,6,447,7],[447,8,447,9],[447,10,447,11],[447,12,447,13],[447,14,447,15],[447,16,447,17],[465,2,465,3],[465,4,465,5],[465,6,465,7],[465,8,465,9],[465,10,465,11],[465,12,465,13],[465,14,465,15],[465,16,465,17],[473,0,473,18],[475,2,475,17],[476,2,476,3],[476,4,476,5],[476,6,476,7],[476,8,476,9],[476,10,476,11],[476,12,476,13],[476,14,476,15],[476,16,476,17],[478,2,478,3],[478,4,478,5],[478,6,478,7],[478,8,478,9],[478,10,478,11],[478,12,478,13],[478,14,478,15],[478,16,478,17],[479,2,479,17],[489,2,489,3],[489,4,489,5],[489,6,489,7],[489,8,489,9],[489,10,489,11],[489,12,489,13],[489,14,489,15],[489,16,489,17],[490,2,490,3],[490,4,490,5],[490,6,490,7],[490,8,490,9],[490,10,490,11],[490,12,490,13],[490,14,490,15],[490,16,490,17],[491,2,491,17],[522,2,522,17],[523,2,523,3],[523,4,523,5],[523,6,523,7],[523,8,523,9],[523,10,523,11],[523,12,523,13],[523,14,523,15],[523,16,523,17],[535,2,535,17],[536,2,536,17],[537,2,537,17],[540,2,540,17],[541,2,541,3],[541,4,541,5],[541,6,541,7],[541,8,541,9],[541,10,541,11],[541,12,541,13],[541,14,541,15],[541,16,541,17],[546,2,546,17],[547,2,547,17],[553,2,553,17],[554,2,554,3],[554,4,554,5],[554,6,554,7],[554,8,554,9],[554,10,554,11],[554,12,554,13],[554,14,554,15],[554,16,554,17],[570,2,570,17],[571,2,571,17],[575,2,575,17],[577,2,577,3],[577,4,577,5],[577,6,577,7],[577,8,577,9],[577,10,577,11],[577,12,577,13],[577,14,577,15],[577,16,577,17],[578,2,578,17],[580,2,580,17],[582,2,582,3],[582,4,582,5],[582,6,582,7],[582,8,582,9],[582,10,582,11],[582,12,582,13],[582,14,582,15],[582,16,582,17]]}
[null,"Planning of C-NET detector lines"]
[]
[null,"Purpose:"]
[null,"With the project planning of the detector line the load of the line card is verified. This results in the definite:"]
[null,"- number and type of devices per detector line"]
[null,"- load of the panel in idle and alarm state"]
[]
[]
[]
[null,"Procedure:"]
[]
[null,"1.) Choose correct Alarm indicator extras (per loop/stub)"]
[null,"2.) Choose Device population topology (loop or stub)"]
[null,"3.) Enter the number of devices per loop/stub in the table"]
[null,"4.) Input cable characteristics and cable length"]
[null,"5.) Choose calculation characteristics"]
[null,"--> Worst case: All devices are placed at end of line for calculation"]
[null,"--> Equally: All devices are distributed equally over cable length. Possibility to add extra start and end cable length"]
[null,"6.) Add start and end cable length in case of equal distribution"]
[null,"7.) Check that no input field is orange"]
[null,"8.) Click 'Press Button to refresh calculation'"]
[null,"9.) All data are now complete. The program calculates the configuration"]
[null,"--> If all analyses are \"green\" , configuration is \"Configuration valid\""]
[null,"--> If some analysis field are red and \"Configuration not valid\" is red, change parameters to get a valid configuration"]
{"$rows_empty":7}
[null,"Please consider:"]
[null,"If a control is connected to an external AI, this must be entered at Ext. AI-Control rows"]
[]
[null,"yellow fields - Must be filled in by the user"]
[null,"orange fields - Shows an input data error. These fields must be filled in by the user"]
[null,"red fields - Calculated value, configuration not valid"]
[null,"clear fields - Calculated value, additional information for the user"]
{"$rows_empty":7}
["Input number of devices"]
[]
[null,"Help values",{"$nulls":18},"Abbreviations"]
[{"$nulls":20},"FDnetAK:  FDnet Adressindex (Adresskennzahl), Number of by the device used bus-addresses (including sub-addresses)"]
[null,null,"Loop / Stub",{"$nulls":3},"Loop / Stub",{"$nulls":3},"Loop / Stub",{"$nulls":3},"Loop / Stub",{"$nulls":5},"FDnetRK: FDnet Ruhestromkennzahl (Quietindex); average current of the device in idle state (in load factors). Necessary to calculate the emergency power"]
[null,null,"Loop",{"$nulls":3},"Loop",{"$nulls":3},"Loop",{"$nulls":3},"Loop",{"$nulls":5},"FDnetMK: FDnet Melderkennzahl (Deviceindex); maximal average current of the device, normally in alarm state (in load factors), without internal or external AI"]
[{"$nulls":20},"FDnetTK:  FDnet Trennerkennzahl (Isolator index); separator connection factor: devices with separator = 1, without separator = 0"]
[null,null,"Stub1_1 ",null,"Stub1_2",null,"Stub2_1 ",null,"Stub2_2",null,"Stub3_1 ",null,"Stub3_2",null,"Stub4_1 ",null,"Stub4_2",{"$nulls":3},"Internal AI: Device has an internal AI"]
[null,null,true,null,false,null,false,null,false,null,false,null,false,null,false,null,false,{"$nulls":3},"Constant Current: Device consumes current independent from device voltage"]
[{"$nulls":20},"Constant Power: Device consumes current regulated by device voltage"]
[null,"Selection Card (Normal, PowerBus)",{"$nulls":18},"Low ohmic FET: Device has an low ohmic isolator FET"]
[null,1,"Selection card",{"$nulls":17},"16V min. device voltage: Device need  at min. 16V"]
[]
[]
[]
[null,"Alarm indicator extras"]
[null,"Alarm Indicator extras"]
[null,"None","Alarm Indicator extras"]
[null,{"v":0.005333333333333333,"d":"0.005"},"Alarm Indicator Current [A]"]
[null,0.0004,"Alarm Indicator Current Ex-Line [A]"]
[]
[]
[null,"Choose max. Line current"]
[null,"Choose Current"]
[null,0.5,"Chosen card current"]
[]
[]
[]
[null,"ExtensionView"]
[null,false]
[null,"Ext. changable"]
[null,false]
[null,"Loop2 visible"]
[null,false]
[null,"Device Population",true,{"$nulls":17},"FDnetRK",null,null,"FDnetMK"]
[{"$nulls":20},"Total","Constant",null,"Total","Constant"]
[null,null,"Loop1",null,"Stub1_2",null,"Stub2_1",null,"Stub2_2",null,"Loop3",null,"Stub3_2",null,"Loop4",null,"Stub4_2",{"$nulls":4},"Current","Power",null,"Current","Power","FDnetTK","FDnetAK","Internal AI","Low ohmic FET","16V min. device voltage","Remarks"]
[null,"Point detectors",{"$nulls":19},"Constant Current",null,null,"constant power",{"$nulls":6},"Point detectors"]
[null,"OP720 - Smoke detector",0,"pcs.",0,"pcs.",0,"pcs.",0,"pcs.",0,"pcs.",0,"pcs.",0,"pcs.",0,"pcs.",null,null,{"$f":"V84+W84","v":1},1,0,{"$f":"Y84+Z84","v":1},1,0,1,1,1,0,0,{"$f":"B84","v":"OP720 - Smoke detector"}]
[null,"HI722 - Heat detector",0,"pcs.",0,"pcs.",0,"pcs.",0,"pcs.",0,"pcs.",0,"pcs.",0,"pcs.",0,"pcs.",null,null,{"$f":"V85+W85","v":1},1,0,{"$f":"Y85+Z85","v":1},1,0,1,1,1,0,0,"HI722 - Heat detector"]
[null,"HI720 - Heat detector",0,"pcs.",0,"pcs.",0,"pcs.",0,"pcs.",0,"pcs.",0,"pcs.",0,"pcs.",0,"pcs.",null,null,1,1,0,1,1,0,1,1,1,0,0,"HI720 - Heat detector"]
[null,"OH720 - Multi Sensor detector",0,"pcs.",0,"pcs.",0,"pcs.",0,"pcs.",0,"pcs.",0,"pcs.",0,"pcs.",0,"pcs.",null,null,1,1,0,1,1,0,1,1,1,0,0,"OH720 - Multi Sensor detector"]
[null,"OOH740 - Multi Sensor detector",0,"pcs.",0,"pcs.",0,"pcs.",0,"pcs.",0,"pcs.",0,"pcs.",0,"pcs.",0,"pcs.",null,null,1,1,0,1,1,0,1,1,1,0,0,"OOH740 - Multi Sensor detector"]
[null,"OP360 - Smoke detector",0,"pcs.",0,"pcs.",0,"pcs.",0,"pcs.",0,"pcs.",0,"pcs.",0,"pcs.",0,"pcs.",null,null,1,1,0,1,1,0,1,1,1,0,0,"OP360 - Smoke detector"]
[null,"OH360 - Multi-sensor smoke detector",0,"pcs.",0,"pcs.",0,"pcs.",0,"pcs.",0,"pcs.",0,"pcs.",0,"pcs.",0,"pcs.",null,null,1,1,0,1,1,0,1,1,1,0,0,"OH360 - Multi-sensor smoke detector"]
[null,"HI360 - Heat detector (RoR)",0,"pcs.",0,"pcs.",0,"pcs.",0,"pcs.",0,"pcs.",0,"pcs.",0,"pcs.",0,"pcs.",null,null,1,1,0,1,1,0,1,1,1,0,0,"HI360 - Heat detector (RoR)"]
[{"$nulls":20},0,null,null,0,{"$nulls":7},0]
[{"$nulls":20},0,null,null,0,{"$nulls":7},0]
[{"$nulls":20},0,null,null,0,{"$nulls":7},0]
[{"$nulls":20},0,null,null,0,{"$nulls":7},0]
[{"$nulls":20},0,null,null,0,{"$nulls":7},0]
[{"$nulls":20},0,null,null,0,{"$nulls":7},0]
[{"$nulls":20},0,null,null,0,{"$nulls":7},0]
[{"$nulls":20},0,null,null,0,{"$nulls":7},0]
[null,"Special detectors",{"$nulls":29},"Special detectors"]
[null,"FDF241-9 - Infrared flame detector",0,"pcs.",0,"pcs.",0,"pcs.",0,"pcs.",0,"pcs.",0,"pcs.",0,"pcs.",0,"pcs.",null,null,3,3,0,3,3,0,1,1,1,0,0,"FDF241-9 - Infrared flame detector"]
[null,"FDL241-9 - Linear smoke detector",0,"pcs.",0,"pcs.",0,"pcs.",0,"pcs.",0,"pcs.",0,"pcs.",0,"pcs.",0,"pcs.",null,null,4,4,0,4,4,0,1,1,1,0,0,"FDL241-9 - Linear smoke detector"]
[null,"OOHC740 - Neural Fire and CO detector",0,"pcs.",0,"pcs.",0,"pcs.",0,"pcs.",0,"pcs.",0,"pcs.",0,"pcs.",0,"pcs.",null,null,2,2,0,2,2,0,1,1,1,0,0,"OOHC740 - Neural Fire and CO detector"]
[{"$nulls":20},0,null,null,0,{"$nulls":7},0]
[{"$nulls":20},0,null,null,0,{"$nulls":7},0]
[{"$nulls":20},0,null,null,0,{"$nulls":7},0]
[{"$nulls":20},0,null,null,0,{"$nulls":7},0]
[{"$nulls":20},0,null,null,0,{"$nulls":7},0]
[{"$nulls":20},0,null,null,0,{"$nulls":7},0]
[{"$nulls":20},0,null,null,0,{"$nulls":7},0]
[{"$nulls":20},0,null,null,0,{"$nulls":7},0]
[{"$nulls":20},0,null,null,0,{"$nulls":7},0]
[{"$nulls":20},0,null,null,0,{"$nulls":7},0]
[{"$nulls":20},0,null,null,0,{"$nulls":7},0]
[null,"Manual call points",{"$nulls":29},"Manual call points"]
[null,"FDM22x - Manual call points",0,"pcs.",0,"pcs.",0,"pcs.",0,"pcs.",0,"pcs.",0,"pcs.",0,"pcs.",0,"pcs.",null,null,1,1,0,1,1,0,1,1,1,0,0,"FDM22x - Manual call points"]
[null,"FDM231 - Manual call point",0,"pcs.",0,"pcs.",0,"pcs.",0,"pcs.",0,"pcs.",0,"pcs.",0,"pcs.",0,"pcs.",null,null,1,1,0,1,1,0,1,1,1,0,0,"FDM231 - Manual call point"]
[null,"FDM365-RP - Resettable MCP",0,"pcs.",0,"pcs.",0,"pcs.",0,"pcs.",0,"pcs.",0,"pcs.",0,"pcs.",0,"pcs.",null,null,1,1,0,1,1,0,1,1,1,0,0,"FDM365-RP - Resettable MCP"]
[{"$nulls":20},0,null,null,0,{"$nulls":7},0]
[{"$nulls":20},0,null,null,0,{"$nulls":7},0]
[{"$nulls":20},0,null,null,0,{"$nulls":7},0]
[{"$nulls":20},0,null,null,0,{"$nulls":7},0]
[{"$nulls":20},0,null,null,0,{"$nulls":7},0]
[{"$nulls":20},0,null,null,0,{"$nulls":7},0]
[{"$nulls":20},0,null,null,0,{"$nulls":7},0]
[{"$nulls":20},0,null,null,0,{"$nulls":7},0]
[null,"Line modules",{"$nulls":29},"Line modules"]
[null,"FDCI221 - Input module (1I)",0,"pcs.",0,"pcs.",0,"pcs.",0,"pcs.",0,"pcs.",0,"pcs.",0,"pcs.",0,"pcs.",null,null,2,2,0,2,2,0,1,1,0,0,0,"FDCI221 - Input module (1I)"]
[null,"FDCI222 - Input module (4I)",0,"pcs.",0,"pcs.",0,"pcs.",0,"pcs.",0,"pcs.",0,"pcs.",0,"pcs.",0,"pcs.",null,null,2,2,0,2,2,0,1,1,0,0,0,"FDCI222 - Input module (4I)"]
[null,"FDCIO221 - In/Output module (1I&1O)",0,"pcs.",0,"pcs.",0,"pcs.",0,"pcs.",0,"pcs.",0,"pcs.",0,"pcs.",0,"pcs.",null,null,2,2,0,2,2,0,1,1,0,0,0,"FDCIO221 - In/Output module (1I&1O)"]
[null,"FDCIO222 - In/Output module (4I&4O)",0,"pcs.",0,"pcs.",0,"pcs.",0,"pcs.",0,"pcs.",0,"pcs.",0,"pcs.",0,"pcs.",null,null,3,3,0,3,3,0,1,1,0,0,0,"FDCIO222 - In/Output module (4I&4O)"]
[null,"FDCIO224 - In/Output module (4I&4O)",0,"pcs.",0,"pcs.",0,"pcs.",0,"pcs.",0,"pcs.",0,"pcs.",0,"pcs.",0,"pcs.",null,null,3,3,0,3,3,0,1,1,0,0,0,"FDCIO224 - In/Output module (4I&4O)"]
[null,"FDCL221 - Line isolator",0,"pcs.",0,"pcs.",0,"pcs.",0,"pcs.",0,"pcs.",0,"pcs.",0,"pcs.",0,"pcs.",null,null,1,1,0,1,1,0,1,1,0,0,0,"FDCL221 - Line isolator"]
[null,"FDCL221-M - Multi line isolator",0,"pcs.",0,"pcs.",0,"pcs.",0,"pcs.",0,"pcs.",0,"pcs.",0,"pcs.",0,"pcs.",null,null,9,9,0,9,9,0,9,9,0,0,0,"FDCL221-M - Multi line isolator"]
[null,"FDCI723 - Zone module, ext. powered (1 collective line)",0,"pcs.",0,"pcs.",0,"pcs.",0,"pcs.",0,"pcs.",0,"pcs.",0,"pcs.",0,"pcs.",null,null,3,3,0,3,3,0,1,1,0,0,0,"FDCI723 - Zone module, ext. powered (1 collective line)"]
[null,"FDCI361 - Input module",0,"pcs.",0,"pcs.",0,"pcs.",0,"pcs.",0,"pcs.",0,"pcs.",0,"pcs.",0,"pcs.",null,null,2,2,0,2,2,0,1,1,0,0,0,{"$f":"B136","v":"FDCI361 - Input module"}]
[null,"FDCIO361 - Input/Output module",0,"pcs.",0,"pcs.",0,"pcs.",0,"pcs.",0,"pcs.",0,"pcs.",0,"pcs.",0,"pcs.",null,null,2,2,0,2,2,0,1,1,0,0,0,"FDCIO361 - Input/Output module"]
[{"$nulls":31},0]
[{"$nulls":31},0]
[{"$nulls":31},0]
[{"$nulls":31},0]
[{"$nulls":31},0]
[{"$nulls":31},0]
[{"$nulls":31},0]
[{"$nulls":31},0]
[null,"Radio devices",{"$nulls":29},"Radio devices"]
[]
[]
[]
[]
[]
[{"$nulls":31},{"$f":"B152","v":0}]
[{"$nulls":31},0]
[{"$nulls":31},0]
[{"$nulls":31},0]
[{"$nulls":31},0]
[{"$nulls":31},0]
[{"$nulls":31},0]
[{"$nulls":31},0]
[{"$nulls":31},0]
[{"$nulls":31},0]
[null,"Integrated modules",{"$nulls":29},"Integrated modules"]
[]
[]
[{"$nulls":31},0]
[{"$nulls":31},0]
[{"$nulls":31},0]
[{"$nulls":31},0]
[{"$nulls":31},0]
[{"$nulls":31},0]
[{"$nulls":31},0]
[{"$nulls":31},0]
[{"$nulls":31},0]
[{"$nulls":31},0]
[null,"Alarm devices - Sound",{"$nulls":29},"Alarm devices - Sound"]
[null,"FDS221-R, FDS221-W - Alarm sounder red or white housing, Volume High",0,"pcs.",0,"pcs.",0,"pcs.",0,"pcs.",0,"pcs.",0,"pcs.",0,"pcs.",0,"pcs.",null,null,{"$f":"V176+W176","v":1},1,0,{"$f":"Y176+Z176","v":15},15,0,1,1,0,0,0,"FDS221-R, FDS221-W - Alarm sounder red or white housing, Volume High"]
[null,"FDS221-R, FDS221-W - Alarm sounder red or white housing, Volume Medium",0,"pcs.",0,"pcs.",0,"pcs.",0,"pcs.",0,"pcs.",0,"pcs.",0,"pcs.",0,"pcs.",null,null,1,1,0,10,10,0,1,1,0,0,0,"FDS221-R, FDS221-W - Alarm sounder red or white housing, Volume Medium"]
[null,"FDS221-R, FDS221-W - Alarm sounder red or white housing, Volume Low",0,"pcs.",0,"pcs.",0,"pcs.",0,"pcs.",0,"pcs.",0,"pcs.",0,"pcs.",0,"pcs.",null,null,1,1,0,5,5,0,1,1,0,0,0,"FDS221-R, FDS221-W - Alarm sounder red or white housing, Volume Low"]
[null,"DBS720 - Sounder base, Volume High",0,"pcs.",0,"pcs.",0,"pcs.",0,"pcs.",0,"pcs.",0,"pcs.",0,"pcs.",0,"pcs.",null,null,0.5,0.5,0,5,5,0,0,0,0,0,0,"DBS720 - Sounder base, Volume High"]
[null,"DBS720 - Sounder base, Volume Medium",0,"pcs.",0,"pcs.",0,"pcs.",0,"pcs.",0,"pcs.",0,"pcs.",0,"pcs.",0,"pcs.",null,null,0.5,0.5,0,5,5,0,0,0,0,0,0,"DBS720 - Sounder base, Volume Medium"]
[null,"DBS721 - Sounder interbase, Volume High",0,"pcs.",0,"pcs.",0,"pcs.",0,"pcs.",0,"pcs.",0,"pcs.",0,"pcs.",0,"pcs.",null,null,1,1,0,15,15,0,1,1,0,0,0,"DBS721 - Sounder interbase, Volume High"]
[null,"DBS721 - Sounder interbase, Volume Medium",0,"pcs.",0,"pcs.",0,"pcs.",0,"pcs.",0,"pcs.",0,"pcs.",0,"pcs.",0,"pcs.",null,null,1,1,0,10,10,0,1,1,0,0,0,"DBS721 - Sounder interbase, Volume Medium"]
[null,"DBS721 - Sounder interbase, Volume Low",0,"pcs.",0,"pcs.",0,"pcs.",0,"pcs.",0,"pcs.",0,"pcs.",0,"pcs.",0,"pcs.",null,null,1,1,0,5,5,0,1,1,0,0,0,"DBS721 - Sounder interbase, Volume Low"]
[null,"FDS224-R, FDS224-W - Sounder red or white housing, Volume High",0,"pcs.",0,"pcs.",0,"pcs.",0,"pcs.",0,"pcs.",0,"pcs.",0,"pcs.",0,"pcs.",null,null,1,1,0,15,15,0,1,1,0,1,0,"FDS224-R, FDS224-W - Sounder red or white housing, Volume High"]
[null,"FDS224-R, FDS224-W - Sounder red or white housing, Volume Medium",0,"pcs.",0,"pcs.",0,"pcs.",0,"pcs.",0,"pcs.",0,"pcs.",0,"pcs.",0,"pcs.",null,null,1,1,0,8,8,0,1,1,0,1,0,"FDS224-R, FDS224-W - Sounder red or white housing, Volume Medium"]
[null,"FDS224-R, FDS224-W - Sounder red or white housing, Volume Low",0,"pcs.",0,"pcs.",0,"pcs.",0,"pcs.",0,"pcs.",0,"pcs.",0,"pcs.",0,"pcs.",null,null,1,1,0,6,6,0,1,1,0,1,0,"FDS224-R, FDS224-W - Sounder red or white housing, Volume Low"]
[null,"FDS364-R, FDS364-W - Sounder red or white housing, Volume High",0,"pcs.",0,"pcs.",0,"pcs.",0,"pcs.",0,"pcs.",0,"pcs.",0,"pcs.",0,"pcs.",null,null,1,1,0,15,15,0,1,1,0,1,0,"FDS364-R, FDS364-W - Sounder red or white housing, Volume High"]
[{"$nulls":31},0]
[{"$nulls":31},0]
[{"$nulls":31},0]
[{"$nulls":31},0]
[{"$nulls":31},0]
[{"$nulls":31},0]
[{"$nulls":31},0]
[{"$nulls":31},0]
[null,"Alarm devices - Sound and Voice",{"$nulls":29},"Alarm devices - Sound and Voice"]
[null,"FDS225-R, FDS225-W - Voice sounder red or white housing, Volume High",0,"pcs.",0,"pcs.",0,"pcs.",0,"pcs.",0,"pcs.",0,"pcs.",0,"pcs.",0,"pcs.",null,null,{"$f":"V197+W197","v":1},1,0,{"$f":"Y197+Z197","v":18},18,0,1,1,0,1,0,"FDS225-R, FDS225-W - Voice sounder red or white housing, Volume High"]
[null,"FDS225-R, FDS225-W - Voice sounder red or white housing, Volume Medium",0,"pcs.",0,"pcs.",0,"pcs.",0,"pcs.",0,"pcs.",0,"pcs.",0,"pcs.",0,"pcs.",null,null,1,1,0,13,13,0,1,1,0,1,0,"FDS225-R, FDS225-W - Voice sounder red or white housing, Volume Medium"]
[null,"FDS225-R, FDS225-W - Voice sounder red or white housing, Volume Low",0,"pcs.",0,"pcs.",0,"pcs.",0,"pcs.",0,"pcs.",0,"pcs.",0,"pcs.",0,"pcs.",null,null,1,1,0,12,12,0,1,1,0,1,0,"FDS225-R, FDS225-W - Voice sounder red or white housing, Volume Low"]
[null,"FDS226, FDS227 - Sounder used without beacon functionality, Volume High",0,"pcs.",0,"pcs.",0,"pcs.",0,"pcs.",0,"pcs.",0,"pcs.",0,"pcs.",0,"pcs.",null,null,1.25,1.25,0,18,18,0,1,1,0,1,0,"FDS226, FDS227 - Sounder used without beacon functionality, Volume High"]
[null,"FDS226, FDS227 - Sounder used without beacon functionality, Volume Medium",0,"pcs.",0,"pcs.",0,"pcs.",0,"pcs.",0,"pcs.",0,"pcs.",0,"pcs.",0,"pcs.",null,null,1.25,1.25,0,13,13,0,1,1,0,1,0,"FDS226, FDS227 - Sounder used without beacon functionality, Volume Medium"]
[null,"FDS226, FDS227 - Sounder used without beacon functionality, Volume Low",0,"pcs.",0,"pcs.",0,"pcs.",0,"pcs.",0,"pcs.",0,"pcs.",0,"pcs.",0,"pcs.",null,null,1.25,1.25,0,12,12,0,1,1,0,1,0,"FDS226, FDS227 - Sounder used without beacon functionality, Volume Low"]
[{"$nulls":31},0]
[{"$nulls":31},0]
[{"$nulls":31},0]
[{"$nulls":31},0]
[{"$nulls":31},0]
[{"$nulls":31},0]
[{"$nulls":31},0]
[{"$nulls":31},0]
[{"$nulls":31},0]
[{"$nulls":31},0]
[null,"Alarm devices - Sound and Light (Beacon)\nVolume settings is assumed as \"high\" for calculation.",{"$nulls":29},"Alarm devices - Sound and Light (Beacon)\nVolume settings is assumed as \"high\" for calculation."]
[null,"FDS229-A, FDS229-R - Alarm sounder and beacon, amber or red, Light and Volume High",0,"pcs.",0,"pcs.",0,"pcs.",0,"pcs.",0,"pcs.",0,"pcs.",0,"pcs.",0,"pcs.",null,null,{"$f":"V214+W214","v":1},1,0,{"$f":"Y214+Z214","v":30},30,0,1,1,0,0,0,"FDS229-A, FDS229-R - Alarm sounder and beacon, amber or red, Light and Volume High"]
[null,"FDS226 - Sounder beacon, Red Light, High Intensity",0,"pcs.",0,"pcs.",0,"pcs.",0,"pcs.",0,"pcs.",0,"pcs.",0,"pcs.",0,"pcs.",null,null,1.25,1.25,0,111,22,89,1,1,0,1,1,"FDS226 - Sounder beacon, Red Light, High Intensity"]
[null,"FDS226 - Sounder beacon, Red Light, Medium Intensity",0,"pcs.",0,"pcs.",0,"pcs.",0,"pcs.",0,"pcs.",0,"pcs.",0,"pcs.",0,"pcs.",null,null,1.25,1.25,0,80,22,58,1,1,0,1,1,{"$f":"B216","v":"FDS226 - Sounder beacon, Red Light, Medium Intensity"}]
[null,"FDS226 - Sounder beacon, Red Light, Low Intensity",0,"pcs.",0,"pcs.",0,"pcs.",0,"pcs.",0,"pcs.",0,"pcs.",0,"pcs.",0,"pcs.",null,null,1.25,1.25,0,64,22,42,1,1,0,1,1,"FDS226 - Sounder beacon, Red Light, Low Intensity"]
[null,"FDS226 - Sounder beacon, Red Light, Indicator Mode",0,"pcs.",0,"pcs.",0,"pcs.",0,"pcs.",0,"pcs.",0,"pcs.",0,"pcs.",0,"pcs.",null,null,1.25,1.25,0,30,22,8,1,1,0,1,0,"FDS226 - Sounder beacon, Red Light, Indicator Mode"]
[null,"FDS226 - Sounder beacon, White Light, High Intensity",0,"pcs.",0,"pcs.",0,"pcs.",0,"pcs.",0,"pcs.",0,"pcs.",0,"pcs.",0,"pcs.",null,null,1.25,1.25,0,108,22,86,1,1,0,1,1,"FDS226 - Sounder beacon, White Light, High Intensity"]
[null,"FDS226 - Sounder beacon, White Light, Medium Intensity",0,"pcs.",0,"pcs.",0,"pcs.",0,"pcs.",0,"pcs.",0,"pcs.",0,"pcs.",0,"pcs.",null,null,1.25,1.25,0,62,22,40,1,1,0,1,1,"FDS226 - Sounder beacon, White Light, Medium Intensity"]
[null,"FDS226 - Sounder beacon, White Light, Low Intensity",0,"pcs.",0,"pcs.",0,"pcs.",0,"pcs.",0,"pcs.",0,"pcs.",0,"pcs.",0,"pcs.",null,null,1.25,1.25,0,51,22,29,1,1,0,1,1,"FDS226 - Sounder beacon, White Light, Low Intensity"]
[null,"FDS226 - Sounder beacon, White Light, Indicator Mode",0,"pcs.",0,"pcs.",0,"pcs.",0,"pcs.",0,"pcs.",0,"pcs.",0,"pcs.",0,"pcs.",null,null,1.25,1.25,0,30,22,8,1,1,0,1,0,"FDS226 - Sounder beacon, White Light, Indicator Mode"]
[null,"FDSB226 - Sounder beacon base, Red Light, High Intensity",0,"pcs.",0,"pcs.",0,"pcs.",0,"pcs.",0,"pcs.",0,"pcs.",0,"pcs.",0,"pcs.",null,null,1.25,1.25,0,116,23,93,1,1,0,1,1,"FDSB226 - Sounder beacon base, Red Light, High Intensity"]
[null,"FDSB226 - Sounder beacon base, Red Light, Medium Intensity",0,"pcs.",0,"pcs.",0,"pcs.",0,"pcs.",0,"pcs.",0,"pcs.",0,"pcs.",0,"pcs.",null,null,1.25,1.25,0,88,23,65,1,1,0,1,1,"FDSB226 - Sounder beacon base, Red Light, Medium Intensity"]
[null,"FDSB226 - Sounder beacon base, Red Light, Low Intensity",0,"pcs.",0,"pcs.",0,"pcs.",0,"pcs.",0,"pcs.",0,"pcs.",0,"pcs.",0,"pcs.",null,null,1.25,1.25,0,60,23,37,1,1,0,1,1,"FDSB226 - Sounder beacon base, Red Light, Low Intensity"]
[null,"FDSB226 - Sounder beacon base, Red Light, Indicator Mode",0,"pcs.",0,"pcs.",0,"pcs.",0,"pcs.",0,"pcs.",0,"pcs.",0,"pcs.",0,"pcs.",null,null,1.25,1.25,0,31,23,8,1,1,0,1,0,"FDSB226 - Sounder beacon base, Red Light, Indicator Mode"]
[null,"FDSB226 - Sounder beacon base, White Light, High Intensity",0,"pcs.",0,"pcs.",0,"pcs.",0,"pcs.",0,"pcs.",0,"pcs.",0,"pcs.",0,"pcs.",null,null,1.25,1.25,0,132,23,109,1,1,0,1,1,"FDSB226 - Sounder beacon base, White Light, High Intensity"]
[null,"FDSB226 - Sounder beacon base, White Light, Medium Intensity",0,"pcs.",0,"pcs.",0,"pcs.",0,"pcs.",0,"pcs.",0,"pcs.",0,"pcs.",0,"pcs.",null,null,1.25,1.25,0,82,23,59,1,1,0,1,1,"FDSB226 - Sounder beacon base, White Light, Medium Intensity"]
[null,"FDSB226 - Sounder beacon base, White Light, Low Intensity",0,"pcs.",0,"pcs.",0,"pcs.",0,"pcs.",0,"pcs.",0,"pcs.",0,"pcs.",0,"pcs.",null,null,1.25,1.25,0,49,23,26,1,1,0,1,1,"FDSB226 - Sounder beacon base, White Light, Low Intensity"]
[null,"FDSB226 - Sounder beacon base, White Light, Indicator Mode",0,"pcs.",0,"pcs.",0,"pcs.",0,"pcs.",0,"pcs.",0,"pcs.",0,"pcs.",0,"pcs.",null,null,1.25,1.25,0,31,23,8,1,1,0,1,0,"FDSB226 - Sounder beacon base, White Light, Indicator Mode"]
[null,"DBS728 - Sounder beacon interbase, Sound and Light High",0,"pcs.",0,"pcs.",0,"pcs.",0,"pcs.",0,"pcs.",0,"pcs.",0,"pcs.",0,"pcs.",null,null,1,1,0,40,40,0,1,1,0,0,0,"DBS728 - Sounder beacon interbase, Sound and Light High"]
[null,"DBS729 - Sounder beacon interbase, Sound and Light High",0,"pcs.",0,"pcs.",0,"pcs.",0,"pcs.",0,"pcs.",0,"pcs.",0,"pcs.",0,"pcs.",null,null,1,1,0,41,41,0,1,1,0,0,0,"DBS729 - Sounder beacon interbase, Sound and Light High"]
[null,"FDS366-RR Sounder used with beacon functionality, Red Light, Medium Intensity",0,"pcs.",0,"pcs.",0,"pcs.",0,"pcs.",0,"pcs.",0,"pcs.",0,"pcs.",0,"pcs.",null,null,1.25,1.25,0,80,22,58,1,1,0,1,1,"FDS366-RR Sounder used with beacon functionality, Red Light, Medium Intensity"]
[null,"FDS366-RR Sounder used with beacon functionality, Red Light Indicator Mode",0,"pcs.",0,"pcs.",0,"pcs.",0,"pcs.",0,"pcs.",0,"pcs.",0,"pcs.",0,"pcs.",null,null,1.25,1.25,0,30,22,8,1,1,0,1,0,"FDS366-RR Sounder used with beacon functionality, Red Light Indicator Mode"]
[null,"FDS366-RW Sounder used with beacon functionality, White Light, Medium Intensity",0,"pcs.",0,"pcs.",0,"pcs.",0,"pcs.",0,"pcs.",0,"pcs.",0,"pcs.",0,"pcs.",null,null,1.25,1.25,0,62,22,40,1,1,0,1,1,"FDS366-RW Sounder used with beacon functionality, White Light, Medium Intensity"]
[null,"FDS366-RW Sounder used with beacon functionality, White Light Indicator Mode",0,"pcs.",0,"pcs.",0,"pcs.",0,"pcs.",0,"pcs.",0,"pcs.",0,"pcs.",0,"pcs.",null,null,1.25,1.25,0,30,22,8,1,1,0,1,0,"FDS366-RW Sounder used with beacon functionality, White Light Indicator Mode"]
[null,"FDS366-WR Sounder used with beacon functionality, Red Light, Medium Intensity",0,"pcs.",0,"pcs.",0,"pcs.",0,"pcs.",0,"pcs.",0,"pcs.",0,"pcs.",0,"pcs.",null,null,1.25,1.25,0,88,23,65,1,1,0,1,1,"FDS366-WR Sounder used with beacon functionality, Red Light, Medium Intensity"]
[null,"FDS366-WR Sounder used with beacon functionality, Red Light Indicator Mode",0,"pcs.",0,"pcs.",0,"pcs.",0,"pcs.",0,"pcs.",0,"pcs.",0,"pcs.",0,"pcs.",null,null,1.25,1.25,0,31,23,8,1,1,0,1,0,"FDS366-WR Sounder used with beacon functionality, Red Light Indicator Mode"]
[null,"FDS366-WW Sounder used with beacon functionality, White Light, Medium Intensity",0,"pcs.",0,"pcs.",0,"pcs.",0,"pcs.",0,"pcs.",0,"pcs.",0,"pcs.",0,"pcs.",null,null,1.25,1.25,0,82,23,59,1,1,0,1,1,"FDS366-WW Sounder used with beacon functionality, White Light, Medium Intensity"]
[null,"FDS366-WW Sounder used with beacon functionality, White Light Indicator Mode",0,"pcs.",0,"pcs.",0,"pcs.",0,"pcs.",0,"pcs.",0,"pcs.",0,"pcs.",0,"pcs.",null,null,1.25,1.25,0,31,23,8,1,1,0,1,0,"FDS366-WW Sounder used with beacon functionality, White Light Indicator Mode"]
[{"$nulls":31},0]
[{"$nulls":31},0]
[{"$nulls":31},0]
[{"$nulls":31},0]
[{"$nulls":31},0]
[{"$nulls":31},0]
[{"$nulls":31},0]
[{"$nulls":31},0]
[{"$nulls":31},0]
[null,"Alarm devices - Sound and Voice and Light (Beacon)\nVolume settings is assumed as \"high\" for calculation.",{"$nulls":29},"Alarm devices - Sound and Voice and Light (Beacon)\nVolume settings is assumed as \"high\" for calculation."]
[null,"FDS227 - Voice sounder beacon, Red Light, High Intensity",0,"pcs.",0,"pcs.",0,"pcs.",0,"pcs.",0,"pcs.",0,"pcs.",0,"pcs.",0,"pcs.",null,null,{"$f":"V251+W251","v":1.25},1.25,0,{"$f":"Y251+Z251","v":111},23,88,1,1,0,1,1,"FDS227 - Voice sounder beacon, Red Light, High Intensity"]
[null,"FDS227 - Voice sounder beacon, Red Light, Medium Intensity",0,"pcs.",0,"pcs.",0,"pcs.",0,"pcs.",0,"pcs.",0,"pcs.",0,"pcs.",0,"pcs.",null,null,1.25,1.25,0,81,23,58,1,1,0,1,1,"FDS227 - Voice sounder beacon, Red Light, Medium Intensity"]
[null,"FDS227 - Voice sounder beacon, Red Light, Low Intensity",0,"pcs.",0,"pcs.",0,"pcs.",0,"pcs.",0,"pcs.",0,"pcs.",0,"pcs.",0,"pcs.",null,null,1.25,1.25,0,65,23,42,1,1,0,1,1,"FDS227 - Voice sounder beacon, Red Light, Low Intensity"]
[null,"FDS227 - Voice sounder beacon, Red Light, Indicator Mode",0,"pcs.",0,"pcs.",0,"pcs.",0,"pcs.",0,"pcs.",0,"pcs.",0,"pcs.",0,"pcs.",null,null,1.25,1.25,0,32,23,9,1,1,0,1,0,"FDS227 - Voice sounder beacon, Red Light, Indicator Mode"]
[null,"FDS227 - Voice sounder beacon, White Light, High Intensity",0,"pcs.",0,"pcs.",0,"pcs.",0,"pcs.",0,"pcs.",0,"pcs.",0,"pcs.",0,"pcs.",null,null,1.25,1.25,0,110,23,87,1,1,0,1,1,"FDS227 - Voice sounder beacon, White Light, High Intensity"]
[null,"FDS227 - Voice sounder beacon, White Light, Medium Intensity",0,"pcs.",0,"pcs.",0,"pcs.",0,"pcs.",0,"pcs.",0,"pcs.",0,"pcs.",0,"pcs.",null,null,1.25,1.25,0,63,23,40,1,1,0,1,1,"FDS227 - Voice sounder beacon, White Light, Medium Intensity"]
[null,"FDS227 - Voice sounder beacon, White Light, Low Intensity",0,"pcs.",0,"pcs.",0,"pcs.",0,"pcs.",0,"pcs.",0,"pcs.",0,"pcs.",0,"pcs.",null,null,1.25,1.25,0,52,23,29,1,1,0,1,1,"FDS227 - Voice sounder beacon, White Light, Low Intensity"]
[null,"FDS227 - Voice sounder beacon, White Light, Indicator Mode",0,"pcs.",0,"pcs.",0,"pcs.",0,"pcs.",0,"pcs.",0,"pcs.",0,"pcs.",0,"pcs.",null,null,1.25,1.25,0,32,23,9,1,1,0,1,0,"FDS227 - Voice sounder beacon, White Light, Indicator Mode"]
[null,"FDSB227 - Voice sounder beacon base, Red Light, High Intensity",0,"pcs.",0,"pcs.",0,"pcs.",0,"pcs.",0,"pcs.",0,"pcs.",0,"pcs.",0,"pcs.",null,null,1.25,1.25,0,116,24,92,1,1,0,1,1,"FDSB227 - Voice sounder beacon base, Red Light, High Intensity"]
[null,"FDSB227 - Voice sounder beacon base, Red Light, Medium Intensity",0,"pcs.",0,"pcs.",0,"pcs.",0,"pcs.",0,"pcs.",0,"pcs.",0,"pcs.",0,"pcs.",null,null,1.25,1.25,0,88,24,64,1,1,0,1,1,"FDSB227 - Voice sounder beacon base, Red Light, Medium Intensity"]
[null,"FDSB227 - Voice sounder beacon base, Red Light, Low Intensity",0,"pcs.",0,"pcs.",0,"pcs.",0,"pcs.",0,"pcs.",0,"pcs.",0,"pcs.",0,"pcs.",null,null,1.25,1.25,0,61,24,37,1,1,0,1,1,"FDSB227 - Voice sounder beacon base, Red Light, Low Intensity"]
[null,"FDSB227 - Voice sounder beacon base, Red Light, Indicator Mode",0,"pcs.",0,"pcs.",0,"pcs.",0,"pcs.",0,"pcs.",0,"pcs.",0,"pcs.",0,"pcs.",null,null,1.25,1.25,0,33,24,9,1,1,0,1,0,"FDSB227 - Voice sounder beacon base, Red Light, Indicator Mode"]
[null,"FDSB227 - Voice sounder beacon base, White Light, High Intensity",0,"pcs.",0,"pcs.",0,"pcs.",0,"pcs.",0,"pcs.",0,"pcs.",0,"pcs.",0,"pcs.",null,null,1.25,1.25,0,133,24,109,1,1,0,1,1,"FDSB227 - Voice sounder beacon base, White Light, High Intensity"]
[null,"FDSB227 - Voice sounder beacon base, White Light, Medium Intensity",0,"pcs.",0,"pcs.",0,"pcs.",0,"pcs.",0,"pcs.",0,"pcs.",0,"pcs.",0,"pcs.",null,null,1.25,1.25,0,83,24,59,1,1,0,1,1,"FDSB227 - Voice sounder beacon base, White Light, Medium Intensity"]
[null,"FDSB227 - Voice sounder beacon base, White Light, Low Intensity",0,"pcs.",0,"pcs.",0,"pcs.",0,"pcs.",0,"pcs.",0,"pcs.",0,"pcs.",0,"pcs.",null,null,1.25,1.25,0,50,24,26,1,1,0,1,1,"FDSB227 - Voice sounder beacon base, White Light, Low Intensity"]
[null,"FDSB227 - Voice sounder beacon base, White Light, Indicator Mode",0,"pcs.",0,"pcs.",0,"pcs.",0,"pcs.",0,"pcs.",0,"pcs.",0,"pcs.",0,"pcs.",null,null,1.25,1.25,0,33,24,9,1,1,0,1,0,"FDSB227 - Voice sounder beacon base, White Light, Indicator Mode"]
[{"$nulls":20},0,null,null,0,{"$nulls":7},0]
[{"$nulls":20},0,null,null,0,{"$nulls":7},0]
[{"$nulls":20},0,null,null,0,{"$nulls":7},0]
[{"$nulls":20},0,null,null,0,{"$nulls":7},0]
[{"$nulls":20},0,null,null,0,{"$nulls":7},0]
[{"$nulls":20},0,null,null,0,{"$nulls":7},0]
[{"$nulls":20},0,null,null,0,{"$nulls":7},0]
[{"$nulls":20},0,null,null,0,{"$nulls":7},0]
[{"$nulls":20},0,null,null,0,{"$nulls":7},0]
[{"$nulls":20},0,null,null,0,{"$nulls":7},0]
[null,"External AI-Control",{"$nulls":29},"External AI-Control"]
[null,"FDAI9x - Ext. AI-Control",0,"pcs.",0,"pcs.",0,"pcs.",0,"pcs.",0,"pcs.",0,"pcs.",0,"pcs.",0,"pcs.",null,null,0,0,0,1,1,0,0,0,0,0,0,"FDAI9x - Ext. AI-Control"]
[{"$nulls":31},0]
[{"$nulls":20},0,null,null,0,{"$nulls":7},{"$f":"B280","v":0}]
[{"$nulls":20},0,null,null,0,{"$nulls":7},0]
[{"$nulls":20},0,null,null,0,{"$nulls":7},0]
[{"$nulls":20},0,null,null,0,{"$nulls":7},0]
[{"$nulls":20},0,null,null,0,{"$nulls":7},0]
[{"$nulls":20},0,null,null,0,{"$nulls":7},0]
[{"$nulls":20},0,null,null,0,{"$nulls":7},0]
[{"$nulls":20},0,null,null,0,{"$nulls":7},0]
[{"$nulls":20},0,null,null,0,{"$nulls":7},0]
[{"$nulls":20},0,null,null,0,{"$nulls":7},0]
[{"$nulls":20},0,null,null,0,{"$nulls":7},0]
[{"$nulls":20},0,null,null,0,{"$nulls":7},0]
[null,"Operation and indication devices",{"$nulls":29},"Operation and indication devices"]
[null,"FT2010 (supply over C-NET) - FRT",0,"pcs.",0,"pcs.",0,"pcs.",0,"pcs.",0,"pcs.",0,"pcs.",0,"pcs.",0,"pcs.",null,null,20,20,0,160,160,0,1,1,0,0,0,"FT2010 (supply over C-NET) - FRT"]
[null,"FT2010 (with external supply) - FRT",0,"pcs.",0,"pcs.",0,"pcs.",0,"pcs.",0,"pcs.",0,"pcs.",0,"pcs.",0,"pcs.",null,null,20,20,0,20,20,0,1,1,0,0,0,"FT2010 (with external supply) - FRT"]
[null,"FT2011 (supply over C-NET) - FRD",0,"pcs.",0,"pcs.",0,"pcs.",0,"pcs.",0,"pcs.",0,"pcs.",0,"pcs.",0,"pcs.",null,null,20,20,0,160,160,0,1,1,0,0,0,"FT2011 (supply over C-NET) - FRD"]
[null,"FT2011 (with external supply) - FRD",0,"pcs.",0,"pcs.",0,"pcs.",0,"pcs.",0,"pcs.",0,"pcs.",0,"pcs.",0,"pcs.",null,null,20,20,0,20,20,0,1,1,0,0,0,"FT2011 (with external supply) - FRD"]
[null,"FDCAI221 - Addressable alarm indicator",0,"pcs.",0,"pcs.",0,"pcs.",0,"pcs.",0,"pcs.",0,"pcs.",0,"pcs.",0,"pcs.",null,null,1,1,0,1,1,0,1,1,0,0,0,"FDCAI221 - Addressable alarm indicator"]
[]
[]
[]
[]
[{"$nulls":31},{"$f":"B302","v":0}]
[{"$nulls":31},0]
[{"$nulls":31},0]
[{"$nulls":31},0]
[{"$nulls":31},0]
[{"$nulls":31},0]
[{"$nulls":31},0]
[{"$nulls":31},0]
[{"$nulls":31},0]
[{"$nulls":31},0]
[]
[]
[]
[null,"Reserve for new devices"]
[null,"!! Do not fill in new lines !! "]
[null,"!! Problem with indirect links !!"]
{"$rows_empty":14}
[null,"Intrinsically safe stub lines 1 (Ex)  -  Line capacitance max. 82nF, line inductance max. 2.3mH, line resistance max. 50 Ohm",{"$nulls":29},{"$f":"B332","v":"Intrinsically safe stub lines 1 (Ex)  -  Line capacitance max. 82nF, line inductance max. 2.3mH, line resistance max. 50 Ohm"}]
[null,"FDCL221-Ex - Line adaptor Ex",{"$nulls":29},"FDCL221-Ex - Line adaptor Ex"]
[null,"OOH740-A9-Ex - Neural fire detector Ex",0,"Stk.",0,"Stk.",0,"Stk.",0,"Stk.",0,"Stk.",0,"Stk.",0,"Stk.",0,"Stk.",null,null,{"$f":"V334+W334","v":1.25},1.25,0,{"$f":"Y334+Z334","v":1.25},1.25,0,0,1,1,0,0,"OOH740-A9-Ex - Neural fire detector Ex"]
[null,"FDM223-Ex - Manual call point Ex",0,"Stk.",0,"Stk.",0,"Stk.",0,"Stk.",0,"Stk.",0,"Stk.",0,"Stk.",0,"Stk.",null,null,{"$f":"V335+W335","v":1.25},1.25,0,{"$f":"Y335+Z335","v":1.25},1.25,0,0,1,1,0,0,"FDM223-Ex - Manual call point Ex"]
[{"$nulls":31},0]
[{"$nulls":31},0]
[{"$nulls":31},0]
[{"$nulls":31},0]
[{"$nulls":31},0]
[{"$nulls":31},0]
[null,"Ex-Line Adaptor (FDCL221-Ex)",false,null,false,null,false,null,false,null,false,null,false,null,false,null,false,{"$nulls":3},{"$f":"V342+W342","v":10},10,0,{"$f":"Y342+Z342","v":10},10,0,0,1,0,0,0,{"$f":"B341","v":0}]
{"$rows_empty":8}
[null,"Intrinsically safe stub lines 2 (Ex)  -  Line capacitance max. 82nF, line inductance max. 2.3mH, line resistance max. 50 Ohm",{"$nulls":29},{"$f":"B351","v":"Intrinsically safe stub lines 2 (Ex)  -  Line capacitance max. 82nF, line inductance max. 2.3mH, line resistance max. 50 Ohm"}]
[null,"FDCL221-Ex - Line adaptor Ex",{"$nulls":29},"FDCL221-Ex - Line adaptor Ex"]
[null,"OOH740-A9-Ex - Neural fire detector Ex",0,"Stk.",null,null,0,"Stk.",null,null,0,"Stk.",null,null,0,"Stk.",{"$nulls":4},{"$f":"V353+W353","v":1.25},1.25,0,{"$f":"Y353+Z353","v":1.25},1.25,0,0,1,1,0,0,"OOH740-A9-Ex - Neural fire detector Ex"]
[null,"FDM223-Ex - Manual call point Ex",0,"Stk.",null,null,0,"Stk.",null,null,0,"Stk.",null,null,0,"Stk.",{"$nulls":4},{"$f":"V354+W354","v":1.25},1.25,0,{"$f":"Y354+Z354","v":1.25},1.25,0,0,1,1,0,0,"FDM223-Ex - Manual call point Ex"]
[null,null,0,{"$nulls":3},0,{"$nulls":3},0,{"$nulls":3},0,{"$nulls":16},0]
[{"$nulls":31},0]
[{"$nulls":31},0]
[{"$nulls":31},0]
[{"$nulls":31},0]
[{"$nulls":31},0]
[null,"Ex-Line Adaptor (FDCL221-Ex)",false,null,false,null,false,null,false,null,false,null,false,null,false,null,false,{"$nulls":3},{"$f":"V361+W361","v":10},10,0,{"$f":"Y361+Z361","v":10},10,0,0,1,0,0,0]
{"$rows_empty":13}
[null,"Reserve for new devices"]
[null,"!! Do not fill in new lines !! "]
[null,"!! Problem with indirect links !!"]
[]
[]
[null,"End line calculation"]
{"$rows_empty":9}
[null,"Plausibility wireless device (FDCW221)",true,null,true,null,true,null,true,null,true,null,true,null,true,null,true]
[null,null,true]
[null,"Plausibility SWiNG wireless device (FDCW241)",true,null,true,null,true,null,true,null,true,null,true,null,true,null,true]
[null,null,true]
[null,"Amount of FDCIO Input/Output module per loop / stub",0,null,0,null,0,null,0,null,0,null,0,null,0,null,0]
[null,"Amount of FDCIO Input/Output module per line card",0,"pcs"]
[null,"Amount of FT2001 operation devices per loop / stub",0,null,0,null,0,null,0,null,0,null,0,null,0,null,0]
[null,"Amount of FT2001 operation devices per loop / stub) per line card",0,"pcs"]
[null,"Amount of FRT / FRD operation devices per loop / stub",0,null,0,null,0,null,0,null,0,null,0,null,0,null,0]
[null,"Amount of FRT / FRD operation devices .per line card",0,"pcs"]
[null,null,0]
[null,"Plausibility Ex-Adapter (FDCL221-Ex)",true,null,true,null,true,null,true,null,true,null,true,null,true,null,true]
[null,null,true]
[]
["Input cable characteristics"]
[]
[null,"Cable characteristics",{"$f":"$C$80","v":true}]
[null,null,{"$f":"C$82","v":"Loop1"},null,{"$f":"E$82","v":"Stub1_2"},null,{"$f":"G$82","v":"Stub2_1"},null,{"$f":"I$82","v":"Stub2_2"},null,{"$f":"K$82","v":"Loop3"},null,{"$f":"M$82","v":"Stub3_2"},null,{"$f":"O$82","v":"Loop4"},null,{"$f":"Q$82","v":"Stub4_2"}]
[null,"Cable length for line resistor",1,"m",1,"m",1,"m",1,"m",1,"m",1,"m",1,"m",1,"m"]
[null,"Cable length for line capacity",1,"m",1,"m",1,"m",1,"m",1,"m",1,"m",1,"m",1,"m"]
[null,"Resistance value R' of cable",70,"Ohm/km",70,"Ohm/km",70,"Ohm/km",70,"Ohm/km",70,"Ohm/km",70,"Ohm/km",70,"Ohm/km",70,"Ohm/km"]
[null,"Capacitance value Cs' of cable",70,"nF/km",70,"nF/km",70,"nF/km",70,"nF/km",70,"nF/km",70,"nF/km",70,"nF/km",70,"nF/km"]
[]
[]
[null,"Cable type"]
[null,"Enter cable parameter manually"]
{"$rows_empty":14}
[null,null,"Choose Cal.",null,"Choose Cal.",null,"Choose Cal.",null,"Choose Cal.",null,"Choose Cal.",null,"Choose Cal.",null,"Choose Cal.",null,"Choose Cal."]
[null,null,"Worst case",null,"Worst case",null,"Worst case",null,"Worst case",null,"Worst case",null,"Worst case",null,"Worst case",null,"Worst case"]
[]
[]
[]
[null,"Calculation characteristics",{"$f":"$C$80","v":true}]
[]
[null,null,{"$f":"C$82","v":"Loop1"},null,{"$f":"E$82","v":"Stub1_2"},null,{"$f":"G$82","v":"Stub2_1"},null,{"$f":"I$82","v":"Stub2_2"},null,{"$f":"K$82","v":"Loop3"},null,{"$f":"M$82","v":"Stub3_2"},null,{"$f":"O$82","v":"Loop4"},null,{"$f":"Q$82","v":"Stub4_2"}]
[null,"Cable length at start to first device",1,"m",1,"m",1,"m",1,"m",1,"m",1,"m",1,"m",1,"m"]
[]
[null,"Cable length at end to last device",0,"m",0,"m",0,"m",0,"m",0,"m",0,"m",0,"m",0,"m"]
[]
[null,"Average distance between devices",{"v":0,"d":"0.0"},"m",{"v":0,"d":"0.0"},"m",{"v":0,"d":"0.0"},"m",{"v":0,"d":"0.0"},"m",{"v":0,"d":"0.0"},"m",{"v":0,"d":"0.0"},"m",{"v":0,"d":"0.0"},"m",{"v":0,"d":"0.0"},"m"]
[null,"Average distance between low MK devices",{"v":1e-05,"d":"0.0"},"m",{"v":0,"d":"0.0"},"m",{"v":3.4482758620689656E-7,"d":"0.0"},"m",{"v":0,"d":"0.0"},"m",{"v":0.034482758620689655,"d":"0.0"},"m",{"v":0,"d":"0.0"},"m",{"v":3.4482758620689657E-5,"d":"0.0"},"m",{"v":0,"d":"0.0"},"m"]
[null,"Average distance between high MK devices",{"v":1e-05,"d":"0.0"},"m",{"v":0,"d":"0.0"},"m",{"v":1.1111111111111112E-6,"d":"0.0"},"m",{"v":0,"d":"0.0"},"m",{"v":0.1111111111111111,"d":"0.1"},"m",{"v":0,"d":"0.0"},"m",{"v":1.1111111111111112E-4,"d":"0.0"},"m",{"v":0,"d":"0.0"},"m"]
[]
[]
[]
[null,"Plausibility cable lengths",true,null,true,null,true,null,true,null,true,null,true,null,true,null,true]
[null,null,true]
{"$rows_empty":24}
["Analysis of configuration"]
[]
[null,"Device information",{"$f":"$C$80","v":true}]
[null,null,{"$f":"C$82","v":"Loop1"},null,{"$f":"E$82","v":"Stub1_2"},null,{"$f":"G$82","v":"Stub2_1"},null,{"$f":"I$82","v":"Stub2_2"},null,{"$f":"K$82","v":"Loop3"},null,{"$f":"M$82","v":"Stub3_2"},null,{"$f":"O$82","v":"Loop4"},null,{"$f":"Q$82","v":"Stub4_2"}]
[]
[null,"Adressindex (AK) per Loop / Stub",0,null,0,null,0,null,0,null,0,null,0,null,0,null,0]
[null,"Total Adressindex (AK) per Line Card",0]
[]
[]
[null,"Isolator index (TK)",0,null,0,null,0,null,0,null,0,null,0,null,0,null,0]
[null,"Limit for MK Low/High decision",15,null,15,null,15,null,15,null,15,null,15,null,15,null,15]
[null,"Amount Low MK devices (Adressindex)",0,"pcs",0,"pcs",0,"pcs",0,"pcs",0,"pcs",0,"pcs",0,"pcs",0,"pcs"]
[null,"Amount High MK devices (Adressindex)",0,"pcs",0,"pcs",0,"pcs",0,"pcs",0,"pcs",0,"pcs",0,"pcs",0,"pcs"]
[null,"Amount Total MK devices (Adressindex)",0,"pcs",0,"pcs",0,"pcs",0,"pcs",0,"pcs",0,"pcs",0,"pcs",0,"pcs"]
[]
[]
[null,"Quietindex (RK) per Loop / Stub",0,null,0,null,0,null,0,null,0,null,0,null,0,null,0]
[null,"Deviceindex (MK) per Loop / Stub",0,null,0,null,0,null,0,null,0,null,0,null,0,null,0]
[null,"Total Deviceindex (MK) per Line Card",0]
[]
[]
[]
[null,"Ex-Line calculation"]
[null,"Capacitance Extra Load Ex-Line 1",0,"nF",0,"nF",0,"nF",0,"nF",0,"nF",0,"nF",0,"nF",0,"nF"]
[null,"Minimum Line Voltage Ex-Line 1 (less than 19V)",{"v":0,"d":"0.00"},"V",{"v":0,"d":"0.00"},"V",{"v":0,"d":"0.00"},"V",{"v":0,"d":"0.00"},"V",{"v":0,"d":"0.00"},"V",{"v":0,"d":"0.00"},"V",{"v":0,"d":"0.00"},"V",{"v":0,"d":"0.00"},"V"]
[null,"Capacitance Extra Load Ex-Line 2",0,"nF",0,"nF",0,"nF",0,"nF",0,"nF",0,"nF",0,"nF",0,"nF"]
[null,"Minimum Line Voltage Ex-Line 2 (less than 19V)",{"v":0,"d":"0.00"},"V",{"v":0,"d":"0.00"},"V",{"v":0,"d":"0.00"},"V",{"v":0,"d":"0.00"},"V",{"v":0,"d":"0.00"},"V",{"v":0,"d":"0.00"},"V",{"v":0,"d":"0.00"},"V",{"v":0,"d":"0.00"},"V"]
[null,"Alarm Indicator Current for Ex-Line (only if active)",0,"A",0,"A",0,"A",0,"A",0,"A",0,"A",0,"A",0,"A"]
[]
[]
[]
[null,"Minimal Line voltage"]
[null,"Is minimal Device Voltage 16V",false,null,false,null,false,null,false,null,false,null,false,null,false,null,false]
[null,"Minimal Device Voltage",{"v":12,"d":"12.00"},"V",{"v":12,"d":"12.00"},"V",{"v":12,"d":"12.00"},"V",{"v":12,"d":"12.00"},"V",{"v":12,"d":"12.00"},"V",{"v":12,"d":"12.00"},"V",{"v":12,"d":"12.00"},"V",{"v":12,"d":"12.00"},"V"]
[]
[]
[]
[null,"Additional Line information"]
[null,"Leak current",0.016,"A",0.012,"A",0.016,"A",0.012,"A",0.016,"A",0.012,"A",0.016,"A",0.012,"A"]
[null,"Alarm Indicator Current",{"v":0.005333333333333333,"d":"0.005"},"A",{"v":0.005333333333333333,"d":"0.005"},"A",{"v":0.005333333333333333,"d":"0.005"},"A",{"v":0.005333333333333333,"d":"0.005"},"A",{"v":0.005333333333333333,"d":"0.005"},"A",{"v":0.005333333333333333,"d":"0.005"},"A",{"v":0.005333333333333333,"d":"0.005"},"A",{"v":0.005333333333333333,"d":"0.005"},"A"]
[null,"Maximum Cable Length at Start/End for Low MK devices",900,"m",1,"m",900,"m",1,"m",899,"m",1,"m",899,"m",1,"m"]
[null,"Maximum Cable Length at Start/End for High MK devices",900,"m",1,"m",900,"m",1,"m",899,"m",1,"m",899,"m",1,"m"]
[null,"Product Rdet*TK (with High ohmic FET isolator)",{"v":0,"d":"0.0"},"Ohm",{"v":0,"d":"0.0"},"Ohm",{"v":0,"d":"0.0"},"Ohm",{"v":0,"d":"0.0"},"Ohm",{"v":0,"d":"0.0"},"Ohm",{"v":0,"d":"0.0"},"Ohm",{"v":0,"d":"0.0"},"Ohm",{"v":0,"d":"0.0"},"Ohm"]
[null,"Product Rdet*TK (with High and Low ohmic FET isolator)",{"v":0,"d":"0.0"},"Ohm",{"v":0,"d":"0.0"},"Ohm",{"v":0,"d":"0.0"},"Ohm",{"v":0,"d":"0.0"},"Ohm",{"v":0,"d":"0.0"},"Ohm",{"v":0,"d":"0.0"},"Ohm",{"v":0,"d":"0.0"},"Ohm",{"v":0,"d":"0.0"},"Ohm"]
[]
[]
[]
[]
[]
[null,"Alarm calculation",{"$f":"$C$80","v":true}]
[null,null,{"$f":"C$82","v":"Loop1"},null,{"$f":"E$82","v":"Stub1_2"},null,{"$f":"G$82","v":"Stub2_1"},null,{"$f":"I$82","v":"Stub2_2"},null,{"$f":"K$82","v":"Loop3"},null,{"$f":"M$82","v":"Stub3_2"},null,{"$f":"O$82","v":"Loop4"},null,{"$f":"Q$82","v":"Stub4_2"}]
[]
[null,"Alarm Voltage at Line Start, 1st calculation",{"v":0,"d":"0.00"},"V",{"v":0,"d":"0.00"},"V",{"v":0,"d":"0.00"},"V",{"v":0,"d":"0.00"},"V",{"v":0,"d":"0.00"},"V",{"v":0,"d":"0.00"},"V",{"v":0,"d":"0.00"},"V",{"v":0,"d":"0.00"},"V"]
[null,"Alarm Voltage at Line before Cable, 1st calculation",{"v":0,"d":"0.00"},"V",{"v":0,"d":"0.00"},"V",{"v":0,"d":"0.00"},"V",{"v":0,"d":"0.00"},"V",{"v":0,"d":"0.00"},"V",{"v":0,"d":"0.00"},"V",{"v":0,"d":"0.00"},"V",{"v":0,"d":"0.00"},"V"]
[null,"Cable resistor between last device and start line",21.6,"Ohm",{"v":0.125,"d":"0.1"},"Ohm",21.6,"Ohm",{"v":0.125,"d":"0.1"},"Ohm",{"v":21.576,"d":"21.6"},"Ohm",{"v":0.125,"d":"0.1"},"Ohm",{"v":21.576,"d":"21.6"},"Ohm",{"v":0.125,"d":"0.1"},"Ohm"]
[null,"Alarm Current, 1st calculation",{"v":0,"d":"0.000"},"A",{"v":0,"d":"0.000"},"A",{"v":0,"d":"0.000"},"A",{"v":0,"d":"0.000"},"A",{"v":0,"d":"0.000"},"A",{"v":0,"d":"0.000"},"A",{"v":0,"d":"0.000"},"A",{"v":0,"d":"0.000"},"A"]
[null,"Alarm Voltage at Line Start after recursion",{"v":0,"d":"0.00"},"V",{"v":0,"d":"0.00"},"V",{"v":0,"d":"0.00"},"V",{"v":0,"d":"0.00"},"V",{"v":0,"d":"0.00"},"V",{"v":0,"d":"0.00"},"V",{"v":0,"d":"0.00"},"V",{"v":0,"d":"0.00"},"V"]
[null,"Alarm Voltage at Line End after recursion",{"v":0,"d":"0.00"},"V",{"v":0,"d":"0.00"},"V",{"v":0,"d":"0.00"},"V",{"v":0,"d":"0.00"},"V",{"v":0,"d":"0.00"},"V",{"v":0,"d":"0.00"},"V",{"v":0,"d":"0.00"},"V",{"v":0,"d":"0.00"},"V"]
[]
[null,"Maximum alarm current per Loop / Stub",0.5,"A",0.5,"A",0.5,"A",0.5,"A",0.5,"A",0.5,"A",0.5,"A",0.5,"A"]
[null,"Alarm current per Loop / Stub",{"v":0,"d":"0.000"},"A",{"v":0,"d":"0.000"},"A",{"v":0,"d":"0.000"},"A",{"v":0,"d":"0.000"},"A",{"v":0,"d":"0.000"},"A",{"v":0,"d":"0.000"},"A",{"v":0,"d":"0.000"},"A",{"v":0,"d":"0.000"},"A"]
[]
[null,"Maximum alarm current per Line Card",{"v":0.5,"d":" 0.5 A"}]
[null,"Total alarm current per Line Card",{"v":0.5,"d":" 0.500 A"}]
[null,"Current consumption alarm (at Panel by 24V)",{"v":0.039,"d":" 0.039 A"}]
[]
[]
[null,"Quiet calculation",{"$f":"$C$80","v":true}]
[null,null,{"$f":"C$82","v":"Loop1"},null,{"$f":"E$82","v":"Stub1_2"},null,{"$f":"G$82","v":"Stub2_1"},null,{"$f":"I$82","v":"Stub2_2"},null,{"$f":"K$82","v":"Loop3"},null,{"$f":"M$82","v":"Stub3_2"},null,{"$f":"O$82","v":"Loop4"},null,{"$f":"Q$82","v":"Stub4_2"}]
[null,"Quiet Voltage at Line Start, 1st calculation",{"v":0,"d":"0.00"},"V",{"v":0,"d":"0.00"},"V",{"v":0,"d":"0.00"},"V",{"v":0,"d":"0.00"},"V",{"v":0,"d":"0.00"},"V",{"v":0,"d":"0.00"},"V",{"v":0,"d":"0.00"},"V",{"v":0,"d":"0.00"},"V"]
[null,"Quiet Voltage at Line End after recursion",{"v":0,"d":"0.00"},"V",{"v":0,"d":"0.00"},"V",{"v":0,"d":"0.00"},"V",{"v":0,"d":"0.00"},"V",{"v":0,"d":"0.00"},"V",{"v":0,"d":"0.00"},"V",{"v":0,"d":"0.00"},"V",{"v":0,"d":"0.00"},"V"]
[null,"Quiet current per Loop / Stub",{"v":0,"d":"0.000"},"A",{"v":0,"d":"0.000"},"A",{"v":0,"d":"0.000"},"A",{"v":0,"d":"0.000"},"A",{"v":0,"d":"0.000"},"A",{"v":0,"d":"0.000"},"A",{"v":0,"d":"0.000"},"A",{"v":0,"d":"0.000"},"A"]
[]
[null,"Total quiet current per Line Card",{"v":0,"d":" 0.000 A"}]
[null,"Current consumption quiet (at Panel by 24V)",{"v":0.039,"d":" 0.039 A"}]
[]
[]
[]
[]
[]
[null,"Cabling information",{"$f":"$C$80","v":true}]
[null,null,{"$f":"C$82","v":"Loop1"},null,{"$f":"E$82","v":"Stub1_2"},null,{"$f":"G$82","v":"Stub2_1"},null,{"$f":"I$82","v":"Stub2_2"},null,{"$f":"K$82","v":"Loop3"},null,{"$f":"M$82","v":"Stub3_2"},null,{"$f":"O$82","v":"Loop4"},null,{"$f":"Q$82","v":"Stub4_2"}]
[null,"Line Resistors"]
[null,"Resistor load per Loop / Stub",{"v":0.07,"d":"0.1"},"Ohm",{"v":0.07,"d":"0.1"},"Ohm",{"v":0.07,"d":"0.1"},"Ohm",{"v":0.07,"d":"0.1"},"Ohm",{"v":0.07,"d":"0.1"},"Ohm",{"v":0.07,"d":"0.1"},"Ohm",{"v":0.07,"d":"0.1"},"Ohm",{"v":0.07,"d":"0.1"},"Ohm"]
[null,"Additional possible resistor load per Loop / Stub (approximate estimate, dRmax)",{"v":0,"d":"0.0"},"Ohm",{"v":0,"d":"0.0"},"Ohm",{"v":0,"d":"0.0"},"Ohm",{"v":0,"d":"0.0"},"Ohm",{"v":0,"d":"0.0"},"Ohm",{"v":0,"d":"0.0"},"Ohm",{"v":0,"d":"0.0"},"Ohm",{"v":0,"d":"0.0"},"Ohm"]
[null,"Additional possible cable length per Loop / Stub (approximate estimate)",0,"m",0,"m",0,"m",0,"m",0,"m",0,"m",0,"m",0,"m"]
[null,"Additional possible MK per Loop / Stub (approximate estimate)",0,null,0,null,0,null,0,null,0,null,0,null,0,null,0]
[]
[null,"Max. possible line resistor (only with High ohmic FET isolator \"old formula\")",{"v":240,"d":"240.0"},"Ohm",{"v":240,"d":"240.0"},"Ohm",{"v":240,"d":"240.0"},"Ohm",{"v":240,"d":"240.0"},"Ohm",{"v":240,"d":"240.0"},"Ohm",{"v":240,"d":"240.0"},"Ohm",{"v":240,"d":"240.0"},"Ohm",{"v":240,"d":"240.0"},"Ohm"]
[null,"Max. possible line resistor (with High and Low ohmic FET isolator \"old formula\")",{"v":240,"d":"240.0"},"Ohm",{"v":240,"d":"240.0"},"Ohm",{"v":240,"d":"240.0"},"Ohm",{"v":240,"d":"240.0"},"Ohm",{"v":240,"d":"240.0"},"Ohm",{"v":240,"d":"240.0"},"Ohm",{"v":240,"d":"240.0"},"Ohm",{"v":240,"d":"240.0"},"Ohm"]
[]
[]
[null,"Line Capacitance"]
[null,"Maximum line capacitive per Loop / Stub",750,"nF",750,"nF",750,"nF",750,"nF",750,"nF",750,"nF",750,"nF",750,"nF"]
[null,"Cable capacitive per Loop / Stub",0.07,"nF",0.07,"nF",0.07,"nF",0.07,"nF",0.07,"nF",0.07,"nF",0.07,"nF",0.07,"nF"]
[null,"Capacitive extra load of devices per Loop / Stub",0,"nF",0,"nF",0,"nF",0,"nF",0,"nF",0,"nF",0,"nF",0,"nF"]
[]
[null,"Maximum line capacitive per Line Card",{"v":1000,"d":" 1,000 nF"}]
[null,"Total capacitive load per Line Card",{"v":0.28,"d":" 0 nF"}]
[]
[]
[null,"Refresh Check"]
[null,"Refresh Calculation Necessary",true]
[null,"Configuration Check",true]
[null,"Is Line Configuration OK",true,null,true,null,true,null,true,null,true,null,true,null,true,null,true]
[null,"Is Card Configuration OK",true]
[null,"Button Text"]
[null,"Button Text","Press Button to refresh calculation"]
[null,"Calculation Check","Press Button to refresh calculation"]
[null,"Is Line calculation possible (wrong type at input fields)",true,null,true,null,true,null,true,null,true,null,true,null,true,null,true]
[null,null,true]

{"sheet":"Panel_values","index":5,"n_rows":99,"n_cols":13,"rows_kept":99,"hidden":true}
["Panel Types","Variants",{"$nulls":10},"# of entries"]
["Types",1,2,3,4,5,6,7,8,9,10,11]
[1,"FC361-ZZ","FC361-ZA","FC361-YZ","FC361-YA","--","--","--","--","--","--","--",4]
[2,"FC362-ZZ","FC362-ZA","--","--","--","--","--","--","--","--","--",4]
[3,"FC724-ZA","FC724-ZE","FC724-HA","--","--","--","--","--","--","--","--",3]
[4,"FC726-ZA","--","--","--","--","--","--","--","--","--","--",1]
[5,"FT724-ZZ","FT724-HZ","--","--","--","--","--","--","--","--","--",2]
[6,"--","--","--","--","--","--","--","--","--","--","--",0]
[]
[]
["Panel Order Numbers",{"$f":"B$1","v":"Variants"}]
[{"$f":"A$2","v":"Types"},1,2,3,4,5,6,7,8,9,10,11]
[{"$f":"A$3","v":1},"S54433-C112-A1","S54433-C111-A1","S54433-C110-A1","S54433-C109-A1","--","--","--","--","--","--","--"]
[{"$f":"A$4","v":2},"S54433-C112-A1","S54433-C111-A1","S54433-C110-A1","S54433-C109-A1","--","--","--","--","--","--","--"]
[{"$f":"A$5","v":3},"S54400-C30-A2","S54400-C30-A3","S54400-C30-A1","--","--","--","--","--","--","--","--"]
[{"$f":"A$6","v":4},"S54400-C87-A1","--","--","--","--","--","--","--","--","--","--"]
[{"$f":"A$7","v":5},"S54400-C31-A2","S54400-C31-A1","--","--","--","--","--","--","--","--","--"]
[{"$f":"A$8","v":6},"--","--","--","--","--","--","--","--","--","--","--"]
[]
["Panel Descriptions",{"$f":"B$1","v":"Variants"}]
[{"$f":"A$2","v":"Types"},1,2,3,4,5,6,7,8,9,10,11]
[{"$f":"A$3","v":1},"International","International","16 zone LED indicator","16 zone LED indicator","--","--","--","--","--","--","--"]
[{"$f":"A$4","v":2},"International","International","32 zone LED indicator","32 zone LED indicator","NL, with EVAC (10-zone)","--","--","--","--","--","--"]
[{"$f":"A$5","v":3},"International","48 zone LED indicator","NL, with EVAC (10-zone)","--","--","--","--","--","--","--","--"]
[{"$f":"A$6","v":4},"International",null,"--","--","--","--","--","--","--","--","--"]
[{"$f":"A$7","v":5},"International","NL, with EVAC (10-zone)","--","--","--","--","--","--","--","--","--"]
[{"$f":"A$8","v":6},"--","--","--","--","--","--","--","--","--","--","--"]
[]
["Panel LED Equipment",{"$f":"B$1","v":"Variants"}]
[{"$f":"A$2","v":"Types"},1,2,3,4,5,6,7,8,9,10,11]
[{"$f":"A$3","v":1},0,0,0,0,0,0,0,0,0,0,0]
[{"$f":"A$4","v":2},0,0,0,2,0,0,0,0,0,0,0]
[{"$f":"A$5","v":3},0,2,0,0,0,0,0,0,0,0,0]
[{"$f":"A$6","v":4},0,0,0,0,0,0,0,0,0,0,0]
[{"$f":"A$7","v":5},0,0,0,0,0,0,0,0,0,0,0]
[{"$f":"A$8","v":6},0,0,0,0,0,0,0,0,0,0,0]
[]
["Panel FBA Equipment",{"$f":"B$1","v":"Variants"}]
[{"$f":"A$2","v":"Types"},1,2,3,4,5,6,7,8,9,10,11]
[{"$f":"A$3","v":1},0,0,0,0,0,0,0,0,0,0,0]
[{"$f":"A$4","v":2},0,0,0,0,0,0,0,0,0,0,0]
[{"$f":"A$5","v":3},0,0,0,0,0,0,0,0,0,0,0]
[{"$f":"A$6","v":4},0,0,0,0,0,0,0,0,0,0,0]
[{"$f":"A$7","v":5},0,0,0,0,0,0,0,0,0,0,0]
[{"$f":"A$8","v":6},0,0,0,0,0,0,0,0,0,0,0]
[]
["Panel EVAC Equipment",{"$f":"B$1","v":"Variants"}]
[{"$f":"A$2","v":"Types"},1,2,3,4,5,6,7,8,9,10,11]
[{"$f":"A$3","v":1},0,0,1,0,0,0,0,0,0,0,0]
[{"$f":"A$4","v":2},0,0,0,0,1,0,0,0,0,0,0]
[{"$f":"A$5","v":3},0,0,1,0,0,0,0,0,0,0,0]
[{"$f":"A$6","v":4},0,0,0,0,0,0,0,0,0,0,0]
[{"$f":"A$7","v":5},0,1,0,0,0,0,0,0,0,0,0]
[{"$f":"A$8","v":6},0,0,0,0,0,0,0,0,0,0,0]
[]
["Equipment","Periboards","Card cage"]
[{"$f":"A$2","v":"Types"},1,2,3,4,5,6,7,8,9,10,11]
[{"$f":"A$3","v":1},"C-NET","--","--","--","--","--","--","--","--","--","--"]
[{"$f":"A$4","v":2},"C-NET","--","--","--","--","--","--","--","--","--","--"]
[{"$f":"A$5","v":3},"FCI2004-A1","--","--","--","--","--","--","--","--","--","--"]
[{"$f":"A$6","v":4},"FCI2004-A1","FCA2008-A1","--","--","--","--","--","--","--","--","--"]
[{"$f":"A$7","v":5},"FTI2001-A1","--","--","--","--","--","--","--","--","--","--"]
[{"$f":"A$8","v":6},"--","--","--","--","--","--","--","--","--","--","--"]
[]
["Panel Supply Equipm.",{"$f":"B$1","v":"Variants"}]
[{"$f":"A$2","v":"Types"},1,2,3,4,5,6,7,8,9,10,11]
[{"$f":"A$3","v":1},70,70,70,70,"--","--","--","--","--","--","--"]
[{"$f":"A$4","v":2},70,70,70,70,150,"--","--","--","--","--","--"]
[{"$f":"A$5","v":3},150,150,150,"--","--","--","--","--","--","--","--"]
[{"$f":"A$6","v":4},150,"--","--","--","--","--","--","--","--","--","--"]
[{"$f":"A$7","v":5},70,70,"--","--","--","--","--","--","--","--","--"]
[{"$f":"A$8","v":6},"--","--","--","--","--","--","--","--","--","--","--"]
[]
["Max. fitting supply",{"$f":"B$1","v":"Variants"}]
[{"$f":"A$2","v":"Types"},1,2,3,4,5,6,7,8,9,10,11]
[{"$f":"A$3","v":1},70,70,70,70,"--","--","--","--","--","--","--"]
[{"$f":"A$4","v":2},70,70,70,70,300,"--","--","--","--","--","--"]
[{"$f":"A$5","v":3},300,300,300,"--","--","--","--","--","--","--","--"]
[{"$f":"A$6","v":4},300,"--","--","--","--","--","--","--","--","--","--"]
[{"$f":"A$7","v":5},70,70,"--","--","--","--","--","--","--","--","--"]
[{"$f":"A$8","v":6},"--","--","--","--","--","--","--","--","--","--","--"]
[]
["Panels Housings",{"$f":"B$1","v":"Variants"}]
[{"$f":"A$2","v":"Types"},1,2,3,4,5,6,7,8,9,10,11]
[{"$f":"A$3","v":1},"Compact","comfort","Compact","comfort","--","--","--","--","--","--","--"]
[{"$f":"A$4","v":2},"Compact","comfort","Compact","comfort","comfort","--","--","--","--","--","--"]
[{"$f":"A$5","v":3},"comfort","comfort","comfort","--","--","--","--","--","--","--","--"]
[{"$f":"A$6","v":4},"large","--","--","--","--","--","--","--","--","--","--"]
[{"$f":"A$7","v":5},"eco","eco","--","--","--","--","--","--","--","--","--"]
[{"$f":"A$8","v":6},"--","--","--","--","--","--","--","--","--","--","--"]
[]
["Max. fitting battery",{"$f":"B$1","v":"Variants"}]
[{"$f":"A$2","v":"Types"},1,2,3,4,5,6,7,8,9,10,11]
[{"$f":"A$3","v":1},12,25,12,25,"--","--","--","--","--","--","--"]
[{"$f":"A$4","v":2},12,25,12,25,26,"--","--","--","--","--","--"]
[{"$f":"A$5","v":3},26,26,26,"--","--","--","--","--","--","--","--"]
[{"$f":"A$6","v":4},45,"--","--","--","--","--","--","--","--","--","--"]
[{"$f":"A$7","v":5},7,7,"--","--","--","--","--","--","--","--","--"]
[{"$f":"A$8","v":6},"--","--","--","--","--","--","--","--","--","--","--"]

{"sheet":"FDnet_Ref","index":6,"n_rows":584,"n_cols":32,"rows_kept":584,"hidden":true,"merged":[[45,0,45,18],[79,2,79,17],[79,20,79,22],[79,23,79,25],[80,2,80,5],[80,6,80,9],[80,10,80,13],[80,14,80,17],[80,20,81,20],[80,21,80,22],[80,23,81,23],[80,24,80,25],[81,2,81,3],[81,4,81,5],[81,6,81,7],[81,8,81,9],[81,10,81,11],[81,12,81,13],[81,14,81,15],[81,16,81,17],[331,1,331,13],[341,2,341,3],[341,4,341,5],[341,6,341,7],[341,8,341,9],[341,10,341,11],[341,12,341,13],[341,14,341,15],[341,16,341,17],[350,1,350,13],[360,2,360,3],[360,4,360,5],[360,6,360,7],[360,8,360,9],[360,10,360,11],[360,12,360,13],[360,14,360,15],[360,16,360,17],[381,2,381,3],[381,4,381,5],[381,6,381,7],[381,8,381,9],[381,10,381,11],[381,12,381,13],[381,14,381,15],[381,16,381,17],[383,2,383,3],[383,4,383,5],[383,6,383,7],[383,8,383,9],[383,10,383,11],[383,12,383,13],[383,14,383,15],[383,16,383,17],[384,2,384,3],[384,4,384,5],[384,6,384,7],[384,8,384,9],[384,10,384,11],[384,12,384,13],[384,14,384,15],[384,16,384,17],[385,2,385,3],[385,4,385,5],[385,6,385,7],[385,8,385,9],[385,10,385,11],[385,12,385,13],[385,14,385,15],[385,16,385,17],[389,2,389,3],[389,4,389,5],[389,6,389,7],[389,8,389,9],[389,10,389,11],[389,12,389,13],[389,14,389,15],[389,16,389,17],[391,2,391,3],[391,4,391,5],[391,6,391,7],[391,8,391,9],[391,10,391,11],[391,12,391,13],[391,14,391,15],[391,16,391,17],[393,2,393,3],[393,4,393,5],[393,6,393,7],[393,8,393,9],[393,10,393,11],[393,12,393,13],[393,14,393,15],[393,16,393,17],[395,2,395,3],[395,4,395,5],[395,6,395,7],[395,8,395,9],[395,10,395,11],[395,12,395,13],[395,14,395,15],[395,16,395,17],[397,2,397,3],[397,4,397,5],[397,6,397,7],[397,8,397,9],[397,10,397,11],[397,12,397,13],[397,14,397,15],[397,16,397,17],[400,2,400,3],[400,4,400,5],[400,6,400,7],[400,8,400,9],[400,10,400,11],[400,12,400,13],[400,14,400,15],[400,16,400,17],[403,0,403,18],[405,2,405,17],[406,2,406,3],[406,4,406,5],[406,6,406,7],[406,8,406,9],[406,10,406,11],[406,12,406,13],[406,14,406,15],[406,16,406,17],[413,2,413,3],[413,4,413,5],[413,6,413,7],[413,8,413,9],[413,10,413,11],[413,12,413,13],[413,14,413,15],[413,16,413,17],[414,2,414,3],[414,4,414,5],[414,6,414,7],[414,8,414,9],[414,10,414,11],[414,12,414,13],[414,14,414,15],[414,16,414,17],[415,2,415,3],[415,4,415,5],[415,6,415,7],[415,8,415,9],[415,10,415,11],[415,12,415,13],[415,14,415,15],[415,16,415,17],[416,2,416,3],[416,4,416,5],[416,6,416,7],[416,8,416,9],[416,10,416,11],[416,12,416,13],[416,14,416,15],[416,16,416,17],[434,2,434,17],[435,2,435,5],[435,6,435,9],[435,10,435,13],[435,14,435,17],[436,2,436,3],[436,4,436,5],[436,6,436,7],[436,8,436,9],[436,10,436,11],[436,12,436,13],[436,14,436,15],[436,16,436,17],[447,2,447,3],[447,4,447,5],[447,6,447,7],[447,8,447,9],[447,10,447,11],[447,12,447,13],[447,14,447,15],[447,16,447,17],[465,2,465,3],[465,4,465,5],[465,6,465,7],[465,8,465,9],[465,10,465,11],[465,12,465,13],[465,14,465,15],[465,16,465,17],[473,0,473,18],[475,2,475,17],[476,2,476,3],[476,4,476,5],[476,6,476,7],[476,8,476,9],[476,10,476,11],[476,12,476,13],[476,14,476,15],[476,16,476,17],[478,2,478,3],[478,4,478,5],[478,6,478,7],[478,8,478,9],[478,10,478,11],[478,12,478,13],[478,14,478,15],[478,16,478,17],[479,2,479,17],[489,2,489,3],[489,4,489,5],[489,6,489,7],[489,8,489,9],[489,10,489,11],[489,12,489,13],[489,14,489,15],[489,16,489,17],[490,2,490,3],[490,4,490,5],[490,6,490,7],[490,8,490,9],[490,10,490,11],[490,12,490,13],[490,14,490,15],[490,16,490,17],[491,2,491,17],[522,2,522,17],[523,2,523,3],[523,4,523,5],[523,6,523,7],[523,8,523,9],[523,10,523,11],[523,12,523,13],[523,14,523,15],[523,16,523,17],[535,2,535,17],[536,2,536,17],[537,2,537,17],[540,2,540,17],[541,2,541,3],[541,4,541,5],[541,6,541,7],[541,8,541,9],[541,10,541,11],[541,12,541,13],[541,14,541,15],[541,16,541,17],[546,2,546,17],[547,2,547,17],[553,2,553,17],[554,2,554,3],[554,4,554,5],[554,6,554,7],[554,8,554,9],[554,10,554,11],[554,12,554,13],[554,14,554,15],[554,16,554,17],[570,2,570,17],[571,2,571,17],[575,2,575,17],[577,2,577,3],[577,4,577,5],[577,6,577,7],[577,8,577,9],[577,10,577,11],[577,12,577,13],[577,14,577,15],[577,16,577,17],[578,2,578,17],[580,2,580,17],[582,2,582,3],[582,4,582,5],[582,6,582,7],[582,8,582,9],[582,10,582,11],[582,12,582,13],[582,14,582,15],[582,16,582,17]]}
[null,"Planning of C-NET detector lines"]
[]
[null,"Purpose:"]
[null,"With the project planning of the detector line the load of the line card is verified. This results in the definite:"]
[null,"- number and type of devices per detector line"]
[null,"- load of the panel in idle and alarm state"]
[]
[]
[]
[null,"Procedure:"]
[]
[null,"1.) Choose correct Alarm indicator extras (per loop/stub)"]
[null,"2.) Choose Device population topology (loop or stub)"]
[null,"3.) Enter the number of devices per loop/stub in the table"]
[null,"4.) Input cable characteristics and cable length"]
[null,"5.) Choose calculation characteristics"]
[null,"--> Worst case: All devices are placed at end of line for calculation"]
[null,"--> Equally: All devices are distributed equally over cable length. Possibility to add extra start and end cable length"]
[null,"6.) Add start and end cable length in case of equal distribution"]
[null,"7.) Check that no input field is orange"]
[null,"8.) Click 'Press Button to refresh calculation'"]
[null,"9.) All data are now complete. The program calculates the configuration"]
[null,"--> If all analyses are \"green\" , configuration is \"Configuration valid\""]
[null,"--> If some analysis field are red and \"Configuration not valid\" is red, change parameters to get a valid configuration"]
{"$rows_empty":7}
[null,"Please consider:"]
[null,"If a control is connected to an external AI, this must be entered at Ext. AI-Control rows"]
[]
[null,"yellow fields - Must be filled in by the user"]
[null,"orange fields - Shows an input data error. These fields must be filled in by the user"]
[null,"red fields - Calculated value, configuration not valid"]
[null,"clear fields - Calculated value, additional information for the user"]
{"$rows_empty":7}
["Input number of devices"]
[]
[null,"Help values",{"$nulls":18},"Abbreviations"]
[{"$nulls":20},"FDnetAK:  FDnet Adressindex (Adresskennzahl), Number of by the device used bus-addresses (including sub-addresses)"]
[null,null,"Loop / Stub",{"$nulls":3},"Loop / Stub",{"$nulls":3},"Loop / Stub",{"$nulls":3},"Loop / Stub",{"$nulls":5},"FDnetRK: FDnet Ruhestromkennzahl (Quietindex); average current of the device in idle state (in load factors). Necessary to calculate the emergency power"]
[null,null,"Stubs",{"$nulls":3},"Stubs",{"$nulls":3},"Stubs",{"$nulls":3},"Stubs",{"$nulls":5},"FDnetMK: FDnet Melderkennzahl (Deviceindex); maximal average current of the device, normally in alarm state (in load factors), without internal or external AI"]
[{"$nulls":20},"FDnetTK:  FDnet Trennerkennzahl (Isolator index); separator connection factor: devices with separator = 1, without separator = 0"]
[null,null,"Stub1_1 ",null,"Stub1_2",null,"Stub2_1 ",null,"Stub2_2",null,"Stub3_1 ",null,"Stub3_2",null,"Stub4_1 ",null,"Stub4_2",{"$nulls":3},"Internal AI: Device has an internal AI"]
[null,null,true,null,true,null,true,null,true,null,true,null,true,null,true,null,true,{"$nulls":3},"Constant Current: Device consumes current independent from device voltage"]
[{"$nulls":20},"Constant Power: Device consumes current regulated by device voltage"]
[null,"Selection Card (Normal, PowerBus)",{"$nulls":18},"Low ohmic FET: Device has an low ohmic isolator FET"]
[null,1,"Selection card",{"$nulls":17},"16V min. device voltage: Device need  at min. 16V"]
[]
[]
[]
[null,"Alarm indicator extras"]
[null,"Alarm Indicator extras"]
[null,"None","Alarm Indicator extras"]
[null,{"v":0.005333333333333333,"d":"0.005"},"Alarm Indicator Current [A]"]
[null,0.0004,"Alarm Indicator Current Ex-Line [A]"]
[]
[]
[null,"Choose max. Line current"]
[null,"Choose Current"]
[null,"0.5A","Chosen card current"]
[]
[]
[]
[null,"ExtensionView"]
[null,true]
[null,"Ext. changable"]
[null,true]
[null,"Loop2 visible"]
[null,true]
[null,"Device Population","Line card (C-NET) FCL2001-A1",{"$nulls":17},"FDnetRK",null,null,"FDnetMK"]
[{"$nulls":20},"Total","Constant",null,"Total","Constant"]
[null,null,"Stub1_1",null,"Stub1_2",null,"Stub2_1",null,"Stub2_2",null,"Stub3_1",null,"Stub3_2",null,"Stub4_1",null,"Stub4_2",{"$nulls":4},"Current","Power",null,"Current","Power","FDnetTK","FDnetAK","Internal AI","Low ohmic FET","16V min. device voltage","Remarks"]
[null,"Point detectors",{"$nulls":19},"Constant Current",null,null,"constant power",{"$nulls":6},"Point detectors"]
[null,"OP720 - Smoke detector",0,"pcs.",0,"pcs.",0,"pcs.",0,"pcs.",0,"pcs.",0,"pcs.",0,"pcs.",0,"pcs.",null,null,{"$f":"V84+W84","v":1},1,0,{"$f":"Y84+Z84","v":1},1,0,1,1,1,0,0,{"$f":"B84","v":"OP720 - Smoke detector"}]
[null,"HI722 - Heat detector",0,"pcs.",0,"pcs.",0,"pcs.",0,"pcs.",0,"pcs.",0,"pcs.",0,"pcs.",0,"pcs.",null,null,{"$f":"V85+W85","v":1},1,0,{"$f":"Y85+Z85","v":1},1,0,1,1,1,0,0,"HI722 - Heat detector"]
[null,"HI720 - Heat detector",0,"pcs.",0,"pcs.",0,"pcs.",0,"pcs.",0,"pcs.",0,"pcs.",0,"pcs.",0,"pcs.",null,null,1,1,0,1,1,0,1,1,1,0,0,"HI720 - Heat detector"]
[null,"OH720 - Multi Sensor detector",0,"pcs.",0,"pcs.",0,"pcs.",0,"pcs.",0,"pcs.",0,"pcs.",0,"pcs.",0,"pcs.",null,null,1,1,0,1,1,0,1,1,1,0,0,"OH720 - Multi Sensor detector"]
[null,"OOH740 - Multi Sensor detector",0,"pcs.",0,"pcs.",0,"pcs.",0,"pcs.",0,"pcs.",0,"pcs.",0,"pcs.",0,"pcs.",null,null,1,1,0,1,1,0,1,1,1,0,0,"OOH740 - Multi Sensor detector"]
[null,"OP360 - Smoke detector",0,"pcs.",0,"pcs.",0,"pcs.",0,"pcs.",0,"pcs.",0,"pcs.",0,"pcs.",0,"pcs.",null,null,1,1,0,1,1,0,1,1,1,0,0,"OP360 - Smoke detector"]
[null,"OH360 - Multi-sensor smoke detector",0,"pcs.",0,"pcs.",0,"pcs.",0,"pcs.",0,"pcs.",0,"pcs.",0,"pcs.",0,"pcs.",null,null,1,1,0,1,1,0,1,1,1,0,0,"OH360 - Multi-sensor smoke detector"]
[null,"HI360 - Heat detector (RoR)",0,"pcs.",0,"pcs.",0,"pcs.",0,"pcs.",0,"pcs.",0,"pcs.",0,"pcs.",0,"pcs.",null,null,1,1,0,1,1,0,1,1,1,0,0,"HI360 - Heat detector (RoR)"]
[{"$nulls":20},0,null,null,0,{"$nulls":7},0]
[{"$nulls":20},0,null,null,0,{"$nulls":7},0]
[{"$nulls":20},0,null,null,0,{"$nulls":7},0]
[{"$nulls":20},0,null,null,0,{"$nulls":7},0]
[{"$nulls":20},0,null,null,0,{"$nulls":7},0]
[{"$nulls":20},0,null,null,0,{"$nulls":7},0]
[{"$nulls":20},0,null,null,0,{"$nulls":7},0]
[{"$nulls":20},0,null,null,0,{"$nulls":7},0]
[null,"Special detectors",{"$nulls":29},"Special detectors"]
[null,"FDF241-9 - Infrared flame detector",0,"pcs.",0,"pcs.",0,"pcs.",0,"pcs.",0,"pcs.",0,"pcs.",0,"pcs.",0,"pcs.",null,null,3,3,0,3,3,0,1,1,1,0,0,"FDF241-9 - Infrared flame detector"]
[null,"FDL241-9 - Linear smoke detector",0,"pcs.",0,"pcs.",0,"pcs.",0,"pcs.",0,"pcs.",0,"pcs.",0,"pcs.",0,"pcs.",null,null,4,4,0,4,4,0,1,1,1,0,0,"FDL241-9 - Linear smoke detector"]
[null,"OOHC740 - Neural Fire and CO detector",0,"pcs.",0,"pcs.",0,"pcs.",0,"pcs.",0,"pcs.",0,"pcs.",0,"pcs.",0,"pcs.",null,null,2,2,0,2,2,0,1,1,1,0,0,"OOHC740 - Neural Fire and CO detector"]
[{"$nulls":20},0,null,null,0,{"$nulls":7},0]
[{"$nulls":20},0,null,null,0,{"$nulls":7},0]
[{"$nulls":20},0,null,null,0,{"$nulls":7},0]
[{"$nulls":20},0,null,null,0,{"$nulls":7},0]
[{"$nulls":20},0,null,null,0,{"$nulls":7},0]
[{"$nulls":20},0,null,null,0,{"$nulls":7},0]
[{"$nulls":20},0,null,null,0,{"$nulls":7},0]
[{"$nulls":20},0,null,null,0,{"$nulls":7},0]
[{"$nulls":20},0,null,null,0,{"$nulls":7},0]
[{"$nulls":20},0,null,null,0,{"$nulls":7},0]
[{"$nulls":20},0,null,null,0,{"$nulls":7},0]
[null,"Manual call points",{"$nulls":29},"Manual call points"]
[null,"FDM22x - Manual call points",0,"pcs.",0,"pcs.",0,"pcs.",0,"pcs.",0,"pcs.",0,"pcs.",0,"pcs.",0,"pcs.",null,null,1,1,0,1,1,0,1,1,1,0,0,"FDM22x - Manual call points"]
[null,"FDM231 - Manual call point",0,"pcs.",0,"pcs.",0,"pcs.",0,"pcs.",0,"pcs.",0,"pcs.",0,"pcs.",0,"pcs.",null,null,1,1,0,1,1,0,1,1,1,0,0,"FDM231 - Manual call point"]
[null,"FDM365-RP - Resettable MCP",0,"pcs.",0,"pcs.",0,"pcs.",0,"pcs.",0,"pcs.",0,"pcs.",0,"pcs.",0,"pcs.",null,null,1,1,0,1,1,0,1,1,1,0,0,"FDM365-RP - Resettable MCP"]
[{"$nulls":20},0,null,null,0,{"$nulls":7},0]
[{"$nulls":20},0,null,null,0,{"$nulls":7},0]
[{"$nulls":20},0,null,null,0,{"$nulls":7},0]
[{"$nulls":20},0,null,null,0,{"$nulls":7},0]
[{"$nulls":20},0,null,null,0,{"$nulls":7},0]
[{"$nulls":20},0,null,null,0,{"$nulls":7},0]
[{"$nulls":20},0,null,null,0,{"$nulls":7},0]
[{"$nulls":20},0,null,null,0,{"$nulls":7},0]
[null,"Line modules",{"$nulls":29},"Line modules"]
[null,"FDCI221 - Input module (1I)",0,"pcs.",0,"pcs.",0,"pcs.",0,"pcs.",0,"pcs.",0,"pcs.",0,"pcs.",0,"pcs.",null,null,2,2,0,2,2,0,1,1,0,0,0,"FDCI221 - Input module (1I)"]
[null,"FDCI222 - Input module (4I)",0,"pcs.",0,"pcs.",0,"pcs.",0,"pcs.",0,"pcs.",0,"pcs.",0,"pcs.",0,"pcs.",null,null,2,2,0,2,2,0,1,1,0,0,0,"FDCI222 - Input module (4I)"]
[null,"FDCIO221 - In/Output module (1I&1O)",0,"pcs.",0,"pcs.",0,"pcs.",0,"pcs.",0,"pcs.",0,"pcs.",0,"pcs.",0,"pcs.",null,null,2,2,0,2,2,0,1,1,0,0,0,"FDCIO221 - In/Output module (1I&1O)"]
[null,"FDCIO222 - In/Output module (4I&4O)",0,"pcs.",0,"pcs.",0,"pcs.",0,"pcs.",0,"pcs.",0,"pcs.",0,"pcs.",0,"pcs.",null,null,3,3,0,3,3,0,1,1,0,0,0,"FDCIO222 - In/Output module (4I&4O)"]
[null,"FDCIO224 - In/Output module (4I&4O)",0,"pcs.",0,"pcs.",0,"pcs.",0,"pcs.",0,"pcs.",0,"pcs.",0,"pcs.",0,"pcs.",null,null,3,3,0,3,3,0,1,1,0,0,0,"FDCIO224 - In/Output module (4I&4O)"]
[null,"FDCL221 - Line isolator",0,"pcs.",0,"pcs.",0,"pcs.",0,"pcs.",0,"pcs.",0,"pcs.",0,"pcs.",0,"pcs.",null,null,1,1,0,1,1,0,1,1,0,0,0,"FDCL221 - Line isolator"]
[null,"FDCL221-M - Multi line isolator",0,"pcs.",0,"pcs.",0,"pcs.",0,"pcs.",0,"pcs.",0,"pcs.",0,"pcs.",0,"pcs.",null,null,9,9,0,9,9,0,9,9,0,0,0,"FDCL221-M - Multi line isolator"]
[null,"FDCI723 - Zone module, ext. powered (1 collective line)",0,"pcs.",0,"pcs.",0,"pcs.",0,"pcs.",0,"pcs.",0,"pcs.",0,"pcs.",0,"pcs.",null,null,3,3,0,3,3,0,1,1,0,0,0,"FDCI723 - Zone module, ext. powered (1 collective line)"]
[null,"FDCI361 - Input module",0,"pcs.",0,"pcs.",0,"pcs.",0,"pcs.",0,"pcs.",0,"pcs.",0,"pcs.",0,"pcs.",null,null,2,2,0,2,2,0,1,1,0,0,0,{"$f":"B136","v":"FDCI361 - Input module"}]
[null,"FDCIO361 - Input/Output module",0,"pcs.",0,"pcs.",0,"pcs.",0,"pcs.",0,"pcs.",0,"pcs.",0,"pcs.",0,"pcs.",null,null,2,2,0,2,2,0,1,1,0,0,0,"FDCIO361 - Input/Output module"]
[{"$nulls":31},0]
[{"$nulls":31},0]
[{"$nulls":31},0]
[{"$nulls":31},0]
[{"$nulls":31},0]
[{"$nulls":31},0]
[{"$nulls":31},0]
[{"$nulls":31},0]
[null,"Radio devices",{"$nulls":29},"Radio devices"]
[]
[]
[]
[]
[]
[{"$nulls":31},{"$f":"B152","v":0}]
[{"$nulls":31},0]
[{"$nulls":31},0]
[{"$nulls":31},0]
[{"$nulls":31},0]
[{"$nulls":31},0]
[{"$nulls":31},0]
[{"$nulls":31},0]
[{"$nulls":31},0]
[{"$nulls":31},0]
[null,"Integrated modules",{"$nulls":29},"Integrated modules"]
[]
[]
[{"$nulls":31},0]
[{"$nulls":31},0]
[{"$nulls":31},0]
[{"$nulls":31},0]
[{"$nulls":31},0]
[{"$nulls":31},0]
[{"$nulls":31},0]
[{"$nulls":31},0]
[{"$nulls":31},0]
[{"$nulls":31},0]
[null,"Alarm devices - Sound",{"$nulls":29},"Alarm devices - Sound"]
[null,"FDS221-R, FDS221-W - Alarm sounder red or white housing, Volume High",0,"pcs.",0,"pcs.",0,"pcs.",0,"pcs.",0,"pcs.",0,"pcs.",0,"pcs.",0,"pcs.",null,null,{"$f":"V176+W176","v":1},1,0,{"$f":"Y176+Z176","v":15},15,0,1,1,0,0,0,"FDS221-R, FDS221-W - Alarm sounder red or white housing, Volume High"]
[null,"FDS221-R, FDS221-W - Alarm sounder red or white housing, Volume Medium",0,"pcs.",0,"pcs.",0,"pcs.",0,"pcs.",0,"pcs.",0,"pcs.",0,"pcs.",0,"pcs.",null,null,1,1,0,10,10,0,1,1,0,0,0,"FDS221-R, FDS221-W - Alarm sounder red or white housing, Volume Medium"]
[null,"FDS221-R, FDS221-W - Alarm sounder red or white housing, Volume Low",0,"pcs.",0,"pcs.",0,"pcs.",0,"pcs.",0,"pcs.",0,"pcs.",0,"pcs.",0,"pcs.",null,null,1,1,0,5,5,0,1,1,0,0,0,"FDS221-R, FDS221-W - Alarm sounder red or white housing, Volume Low"]
[null,"DBS720 - Sounder base, Volume High",0,"pcs.",0,"pcs.",0,"pcs.",0,"pcs.",0,"pcs.",0,"pcs.",0,"pcs.",0,"pcs.",null,null,0.5,0.5,0,5,5,0,0,0,0,0,0,"DBS720 - Sounder base, Volume High"]
[null,"DBS720 - Sounder base, Volume Medium",0,"pcs.",0,"pcs.",0,"pcs.",0,"pcs.",0,"pcs.",0,"pcs.",0,"pcs.",0,"pcs.",null,null,0.5,0.5,0,5,5,0,0,0,0,0,0,"DBS720 - Sounder base, Volume Medium"]
[null,"DBS721 - Sounder interbase, Volume High",0,"pcs.",0,"pcs.",0,"pcs.",0,"pcs.",0,"pcs.",0,"pcs.",0,"pcs.",0,"pcs.",null,null,1,1,0,15,15,0,1,1,0,0,0,"DBS721 - Sounder interbase, Volume High"]
[null,"DBS721 - Sounder interbase, Volume Medium",0,"pcs.",0,"pcs.",0,"pcs.",0,"pcs.",0,"pcs.",0,"pcs.",0,"pcs.",0,"pcs.",null,null,1,1,0,10,10,0,1,1,0,0,0,"DBS721 - Sounder interbase, Volume Medium"]
[null,"DBS721 - Sounder interbase, Volume Low",0,"pcs.",0,"pcs.",0,"pcs.",0,"pcs.",0,"pcs.",0,"pcs.",0,"pcs.",0,"pcs.",null,null,1,1,0,5,5,0,1,1,0,0,0,"DBS721 - Sounder interbase, Volume Low"]
[null,"FDS224-R, FDS224-W - Sounder red or white housing, Volume High",0,"pcs.",0,"pcs.",0,"pcs.",0,"pcs.",0,"pcs.",0,"pcs.",0,"pcs.",0,"pcs.",null,null,1,1,0,15,15,0,1,1,0,1,0,"FDS224-R, FDS224-W - Sounder red or white housing, Volume High"]
[null,"FDS224-R, FDS224-W - Sounder red or white housing, Volume Medium",0,"pcs.",0,"pcs.",0,"pcs.",0,"pcs.",0,"pcs.",0,"pcs.",0,"pcs.",0,"pcs.",null,null,1,1,0,8,8,0,1,1,0,1,0,"FDS224-R, FDS224-W - Sounder red or white housing, Volume Medium"]
[null,"FDS224-R, FDS224-W - Sounder red or white housing, Volume Low",0,"pcs.",0,"pcs.",0,"pcs.",0,"pcs.",0,"pcs.",0,"pcs.",0,"pcs.",0,"pcs.",null,null,1,1,0,6,6,0,1,1,0,1,0,"FDS224-R, FDS224-W - Sounder red or white housing, Volume Low"]
[null,"FDS364-R, FDS364-W - Sounder red or white housing, Volume High",0,"pcs.",0,"pcs.",0,"pcs.",0,"pcs.",0,"pcs.",0,"pcs.",0,"pcs.",0,"pcs.",null,null,1,1,0,15,15,0,1,1,0,1,0,"FDS364-R, FDS364-W - Sounder red or white housing, Volume High"]
[{"$nulls":31},0]
[{"$nulls":31},0]
[{"$nulls":31},0]
[{"$nulls":31},0]
[{"$nulls":31},0]
[{"$nulls":31},0]
[{"$nulls":31},0]
[{"$nulls":31},0]
[null,"Alarm devices - Sound and Voice",{"$nulls":29},"Alarm devices - Sound and Voice"]
[null,"FDS225-R, FDS225-W - Voice sounder red or white housing, Volume High",0,"pcs.",0,"pcs.",0,"pcs.",0,"pcs.",0,"pcs.",0,"pcs.",0,"pcs.",0,"pcs.",null,null,{"$f":"V197+W197","v":1},1,0,{"$f":"Y197+Z197","v":18},18,0,1,1,0,1,0,"FDS225-R, FDS225-W - Voice sounder red or white housing, Volume High"]
[null,"FDS225-R, FDS225-W - Voice sounder red or white housing, Volume Medium",0,"pcs.",0,"pcs.",0,"pcs.",0,"pcs.",0,"pcs.",0,"pcs.",0,"pcs.",0,"pcs.",null,null,1,1,0,13,13,0,1,1,0,1,0,"FDS225-R, FDS225-W - Voice sounder red or white housing, Volume Medium"]
[null,"FDS225-R, FDS225-W - Voice sounder red or white housing, Volume Low",0,"pcs.",0,"pcs.",0,"pcs.",0,"pcs.",0,"pcs.",0,"pcs.",0,"pcs.",0,"pcs.",null,null,1,1,0,12,12,0,1,1,0,1,0,"FDS225-R, FDS225-W - Voice sounder red or white housing, Volume Low"]
[null,"FDS226, FDS227 - Sounder used without beacon functionality, Volume High",0,"pcs.",0,"pcs.",0,"pcs.",0,"pcs.",0,"pcs.",0,"pcs.",0,"pcs.",0,"pcs.",null,null,1.25,1.25,0,18,18,0,1,1,0,1,0,"FDS226, FDS227 - Sounder used without beacon functionality, Volume High"]
[null,"FDS226, FDS227 - Sounder used without beacon functionality, Volume Medium",0,"pcs.",0,"pcs.",0,"pcs.",0,"pcs.",0,"pcs.",0,"pcs.",0,"pcs.",0,"pcs.",null,null,1.25,1.25,0,13,13,0,1,1,0,1,0,"FDS226, FDS227 - Sounder used without beacon functionality, Volume Medium"]
[null,"FDS226, FDS227 - Sounder used without beacon functionality, Volume Low",0,"pcs.",0,"pcs.",0,"pcs.",0,"pcs.",0,"pcs.",0,"pcs.",0,"pcs.",0,"pcs.",null,null,1.25,1.25,0,12,12,0,1,1,0,1,0,"FDS226, FDS227 - Sounder used without beacon functionality, Volume Low"]
[{"$nulls":31},0]
[{"$nulls":31},0]
[{"$nulls":31},0]
[{"$nulls":31},0]
[{"$nulls":31},0]
[{"$nulls":31},0]
[{"$nulls":31},0]
[{"$nulls":31},0]
[{"$nulls":31},0]
[{"$nulls":31},{"$f":"B212","v":0}]
[null,"Alarm devices - Sound and Light (Beacon)\nVolume settings is assumed as \"high\" for calculation.",{"$nulls":29},"Alarm devices - Sound and Light (Beacon)\nVolume settings is assumed as \"high\" for calculation."]
[null,"FDS229-A, FDS229-R - Alarm sounder and beacon, amber or red, Light and Volume High",0,"pcs.",0,"pcs.",0,"pcs.",0,"pcs.",0,"pcs.",0,"pcs.",0,"pcs.",0,"pcs.",null,null,{"$f":"V214+W214","v":1},1,0,{"$f":"Y214+Z214","v":30},30,0,1,1,0,0,0,"FDS229-A, FDS229-R - Alarm sounder and beacon, amber or red, Light and Volume High"]
[null,"FDS226 - Sounder beacon, Red Light, High Intensity",0,"pcs.",0,"pcs.",0,"pcs.",0,"pcs.",0,"pcs.",0,"pcs.",0,"pcs.",0,"pcs.",null,null,1.25,1.25,0,111,22,89,1,1,0,1,1,"FDS226 - Sounder beacon, Red Light, High Intensity"]
[null,"FDS226 - Sounder beacon, Red Light, Medium Intensity",0,"pcs.",0,"pcs.",0,"pcs.",0,"pcs.",0,"pcs.",0,"pcs.",0,"pcs.",0,"pcs.",null,null,1.25,1.25,0,80,22,58,1,1,0,1,1,"FDS226 - Sounder beacon, Red Light, Medium Intensity"]
[null,"FDS226 - Sounder beacon, Red Light, Low Intensity",0,"pcs.",0,"pcs.",0,"pcs.",0,"pcs.",0,"pcs.",0,"pcs.",0,"pcs.",0,"pcs.",null,null,1.25,1.25,0,64,22,42,1,1,0,1,1,"FDS226 - Sounder beacon, Red Light, Low Intensity"]
[null,"FDS226 - Sounder beacon, Red Light, Indicator Mode",0,"pcs.",0,"pcs.",0,"pcs.",0,"pcs.",0,"pcs.",0,"pcs.",0,"pcs.",0,"pcs.",null,null,1.25,1.25,0,30,22,8,1,1,0,1,0,"FDS226 - Sounder beacon, Red Light, Indicator Mode"]
[null,"FDS226 - Sounder beacon, White Light, High Intensity",0,"pcs.",0,"pcs.",0,"pcs.",0,"pcs.",0,"pcs.",0,"pcs.",0,"pcs.",0,"pcs.",null,null,1.25,1.25,0,108,22,86,1,1,0,1,1,"FDS226 - Sounder beacon, White Light, High Intensity"]
[null,"FDS226 - Sounder beacon, White Light, Medium Intensity",0,"pcs.",0,"pcs.",0,"pcs.",0,"pcs.",0,"pcs.",0,"pcs.",0,"pcs.",0,"pcs.",null,null,1.25,1.25,0,62,22,40,1,1,0,1,1,"FDS226 - Sounder beacon, White Light, Medium Intensity"]
[null,"FDS226 - Sounder beacon, White Light, Low Intensity",0,"pcs.",0,"pcs.",0,"pcs.",0,"pcs.",0,"pcs.",0,"pcs.",0,"pcs.",0,"pcs.",null,null,1.25,1.25,0,51,22,29,1,1,0,1,1,"FDS226 - Sounder beacon, White Light, Low Intensity"]
[null,"FDS226 - Sounder beacon, White Light, Indicator Mode",0,"pcs.",0,"pcs.",0,"pcs.",0,"pcs.",0,"pcs.",0,"pcs.",0,"pcs.",0,"pcs.",null,null,1.25,1.25,0,30,22,8,1,1,0,1,0,"FDS226 - Sounder beacon, White Light, Indicator Mode"]
[null,"FDSB226 - Sounder beacon base, Red Light, High Intensity",0,"pcs.",0,"pcs.",0,"pcs.",0,"pcs.",0,"pcs.",0,"pcs.",0,"pcs.",0,"pcs.",null,null,1.25,1.25,0,116,23,93,1,1,0,1,1,"FDSB226 - Sounder beacon base, Red Light, High Intensity"]
[null,"FDSB226 - Sounder beacon base, Red Light, Medium Intensity",0,"pcs.",0,"pcs.",0,"pcs.",0,"pcs.",0,"pcs.",0,"pcs.",0,"pcs.",0,"pcs.",null,null,1.25,1.25,0,88,23,65,1,1,0,1,1,"FDSB226 - Sounder beacon base, Red Light, Medium Intensity"]
[null,"FDSB226 - Sounder beacon base, Red Light, Low Intensity",0,"pcs.",0,"pcs.",0,"pcs.",0,"pcs.",0,"pcs.",0,"pcs.",0,"pcs.",0,"pcs.",null,null,1.25,1.25,0,60,23,37,1,1,0,1,1,"FDSB226 - Sounder beacon base, Red Light, Low Intensity"]
[null,"FDSB226 - Sounder beacon base, Red Light, Indicator Mode",0,"pcs.",0,"pcs.",0,"pcs.",0,"pcs.",0,"pcs.",0,"pcs.",0,"pcs.",0,"pcs.",null,null,1.25,1.25,0,31,23,8,1,1,0,1,0,"FDSB226 - Sounder beacon base, Red Light, Indicator Mode"]
[null,"FDSB226 - Sounder beacon base, White Light, High Intensity",0,"pcs.",0,"pcs.",0,"pcs.",0,"pcs.",0,"pcs.",0,"pcs.",0,"pcs.",0,"pcs.",null,null,1.25,1.25,0,132,23,109,1,1,0,1,1,"FDSB226 - Sounder beacon base, White Light, High Intensity"]
[null,"FDSB226 - Sounder beacon base, White Light, Medium Intensity",0,"pcs.",0,"pcs.",0,"pcs.",0,"pcs.",0,"pcs.",0,"pcs.",0,"pcs.",0,"pcs.",null,null,1.25,1.25,0,82,23,59,1,1,0,1,1,"FDSB226 - Sounder beacon base, White Light, Medium Intensity"]
[null,"FDSB226 - Sounder beacon base, White Light, Low Intensity",0,"pcs.",0,"pcs.",0,"pcs.",0,"pcs.",0,"pcs.",0,"pcs.",0,"pcs.",0,"pcs.",null,null,1.25,1.25,0,49,23,26,1,1,0,1,1,"FDSB226 - Sounder beacon base, White Light, Low Intensity"]
[null,"FDSB226 - Sounder beacon base, White Light, Indicator Mode",0,"pcs.",0,"pcs.",0,"pcs.",0,"pcs.",0,"pcs.",0,"pcs.",0,"pcs.",0,"pcs.",null,null,1.25,1.25,0,31,23,8,1,1,0,1,0,"FDSB226 - Sounder beacon base, White Light, Indicator Mode"]
[null,"DBS728 - Sounder beacon interbase, Sound and Light High",0,"pcs.",0,"pcs.",0,"pcs.",0,"pcs.",0,"pcs.",0,"pcs.",0,"pcs.",0,"pcs.",null,null,1,1,0,40,40,0,1,1,0,0,0,"DBS728 - Sounder beacon interbase, Sound and Light High"]
[null,"DBS729 - Sounder beacon interbase, Sound and Light High",0,"pcs.",0,"pcs.",0,"pcs.",0,"pcs.",0,"pcs.",0,"pcs.",0,"pcs.",0,"pcs.",null,null,1,1,0,41,41,0,1,1,0,0,0,"DBS729 - Sounder beacon interbase, Sound and Light High"]
[null,"FDS366-RR Sounder used with beacon functionality, Red Light, Medium Intensity",0,"pcs.",0,"pcs.",0,"pcs.",0,"pcs.",0,"pcs.",0,"pcs.",0,"pcs.",0,"pcs.",null,null,1.25,1.25,0,80,22,58,1,1,0,1,1,"FDS366-RR Sounder used with beacon functionality, Red Light, Medium Intensity"]
[null,"FDS366-RR Sounder used with beacon functionality, Red Light Indicator Mode",0,"pcs.",0,"pcs.",0,"pcs.",0,"pcs.",0,"pcs.",0,"pcs.",0,"pcs.",0,"pcs.",null,null,1.25,1.25,0,30,22,8,1,1,0,1,0,"FDS366-RR Sounder used with beacon functionality, Red Light Indicator Mode"]
[null,"FDS366-RW Sounder used with beacon functionality, White Light, Medium Intensity",0,"pcs.",0,"pcs.",0,"pcs.",0,"pcs.",0,"pcs.",0,"pcs.",0,"pcs.",0,"pcs.",null,null,1.25,1.25,0,62,22,40,1,1,0,1,1,"FDS366-RW Sounder used with beacon functionality, White Light, Medium Intensity"]
[null,"FDS366-RW Sounder used with beacon functionality, White Light Indicator Mode",0,"pcs.",0,"pcs.",0,"pcs.",0,"pcs.",0,"pcs.",0,"pcs.",0,"pcs.",0,"pcs.",null,null,1.25,1.25,0,30,22,8,1,1,0,1,0,"FDS366-RW Sounder used with beacon functionality, White Light Indicator Mode"]
[null,"FDS366-WR Sounder used with beacon functionality, Red Light, Medium Intensity",0,"pcs.",0,"pcs.",0,"pcs.",0,"pcs.",0,"pcs.",0,"pcs.",0,"pcs.",0,"pcs.",null,null,1.25,1.25,0,88,23,65,1,1,0,1,1,"FDS366-WR Sounder used with beacon functionality, Red Light, Medium Intensity"]
[null,"FDS366-WR Sounder used with beacon functionality, Red Light Indicator Mode",0,"pcs.",0,"pcs.",0,"pcs.",0,"pcs.",0,"pcs.",0,"pcs.",0,"pcs.",0,"pcs.",null,null,1.25,1.25,0,31,23,8,1,1,0,1,0,"FDS366-WR Sounder used with beacon functionality, Red Light Indicator Mode"]
[null,"FDS366-WW Sounder used with beacon functionality, White Light, Medium Intensity",0,"pcs.",0,"pcs.",0,"pcs.",0,"pcs.",0,"pcs.",0,"pcs.",0,"pcs.",0,"pcs.",null,null,1.25,1.25,0,82,23,59,1,1,0,1,1,"FDS366-WW Sounder used with beacon functionality, White Light, Medium Intensity"]
[null,"FDS366-WW Sounder used with beacon functionality, White Light Indicator Mode",0,"pcs.",0,"pcs.",0,"pcs.",0,"pcs.",0,"pcs.",0,"pcs.",0,"pcs.",0,"pcs.",null,null,1.25,1.25,0,31,23,8,1,1,0,1,0,"FDS366-WW Sounder used with beacon functionality, White Light Indicator Mode"]
[{"$nulls":31},0]
[{"$nulls":31},0]
[{"$nulls":31},0]
[{"$nulls":31},0]
[{"$nulls":31},0]
[{"$nulls":31},0]
[{"$nulls":31},0]
[{"$nulls":31},0]
[{"$nulls":31},0]
[null,"Alarm devices - Sound and Voice and Light (Beacon)\nVolume settings is assumed as \"high\" for calculation.",{"$nulls":29},"Alarm devices - Sound and Voice and Light (Beacon)\nVolume settings is assumed as \"high\" for calculation."]
[null,"FDS227 - Voice sounder beacon, Red Light, High Intensity",0,"pcs.",0,"pcs.",0,"pcs.",0,"pcs.",0,"pcs.",0,"pcs.",0,"pcs.",0,"pcs.",null,null,{"$f":"V251+W251","v":1.25},1.25,0,{"$f":"Y251+Z251","v":111},23,88,1,1,0,1,1,"FDS227 - Voice sounder beacon, Red Light, High Intensity"]
[null,"FDS227 - Voice sounder beacon, Red Light, Medium Intensity",0,"pcs.",0,"pcs.",0,"pcs.",0,"pcs.",0,"pcs.",0,"pcs.",0,"pcs.",0,"pcs.",null,null,1.25,1.25,0,81,23,58,1,1,0,1,1,"FDS227 - Voice sounder beacon, Red Light, Medium Intensity"]
[null,"FDS227 - Voice sounder beacon, Red Light, Low Intensity",0,"pcs.",0,"pcs.",0,"pcs.",0,"pcs.",0,"pcs.",0,"pcs.",0,"pcs.",0,"pcs.",null,null,1.25,1.25,0,65,23,42,1,1,0,1,1,"FDS227 - Voice sounder beacon, Red Light, Low Intensity"]
[null,"FDS227 - Voice sounder beacon, Red Light, Indicator Mode",0,"pcs.",0,"pcs.",0,"pcs.",0,"pcs.",0,"pcs.",0,"pcs.",0,"pcs.",0,"pcs.",null,null,1.25,1.25,0,32,23,9,1,1,0,1,0,"FDS227 - Voice sounder beacon, Red Light, Indicator Mode"]
[null,"FDS227 - Voice sounder beacon, White Light, High Intensity",0,"pcs.",0,"pcs.",0,"pcs.",0,"pcs.",0,"pcs.",0,"pcs.",0,"pcs.",0,"pcs.",null,null,1.25,1.25,0,110,23,87,1,1,0,1,1,"FDS227 - Voice sounder beacon, White Light, High Intensity"]
[null,"FDS227 - Voice sounder beacon, White Light, Medium Intensity",0,"pcs.",0,"pcs.",0,"pcs.",0,"pcs.",0,"pcs.",0,"pcs.",0,"pcs.",0,"pcs.",null,null,1.25,1.25,0,63,23,40,1,1,0,1,1,"FDS227 - Voice sounder beacon, White Light, Medium Intensity"]
[null,"FDS227 - Voice sounder beacon, White Light, Low Intensity",0,"pcs.",0,"pcs.",0,"pcs.",0,"pcs.",0,"pcs.",0,"pcs.",0,"pcs.",0,"pcs.",null,null,1.25,1.25,0,52,23,29,1,1,0,1,1,"FDS227 - Voice sounder beacon, White Light, Low Intensity"]
[null,"FDS227 - Voice sounder beacon, White Light, Indicator Mode",0,"pcs.",0,"pcs.",0,"pcs.",0,"pcs.",0,"pcs.",0,"pcs.",0,"pcs.",0,"pcs.",null,null,1.25,1.25,0,32,23,9,1,1,0,1,0,"FDS227 - Voice sounder beacon, White Light, Indicator Mode"]
[null,"FDSB227 - Voice sounder beacon base, Red Light, High Intensity",0,"pcs.",0,"pcs.",0,"pcs.",0,"pcs.",0,"pcs.",0,"pcs.",0,"pcs.",0,"pcs.",null,null,1.25,1.25,0,116,24,92,1,1,0,1,1,"FDSB227 - Voice sounder beacon base, Red Light, High Intensity"]
[null,"FDSB227 - Voice sounder beacon base, Red Light, Medium Intensity",0,"pcs.",0,"pcs.",0,"pcs.",0,"pcs.",0,"pcs.",0,"pcs.",0,"pcs.",0,"pcs.",null,null,1.25,1.25,0,88,24,64,1,1,0,1,1,"FDSB227 - Voice sounder beacon base, Red Light, Medium Intensity"]
[null,"FDSB227 - Voice sounder beacon base, Red Light, Low Intensity",0,"pcs.",0,"pcs.",0,"pcs.",0,"pcs.",0,"pcs.",0,"pcs.",0,"pcs.",0,"pcs.",null,null,1.25,1.25,0,61,24,37,1,1,0,1,1,"FDSB227 - Voice sounder beacon base, Red Light, Low Intensity"]
[null,"FDSB227 - Voice sounder beacon base, Red Light, Indicator Mode",0,"pcs.",0,"pcs.",0,"pcs.",0,"pcs.",0,"pcs.",0,"pcs.",0,"pcs.",0,"pcs.",null,null,1.25,1.25,0,33,24,9,1,1,0,1,0,"FDSB227 - Voice sounder beacon base, Red Light, Indicator Mode"]
[null,"FDSB227 - Voice sounder beacon base, White Light, High Intensity",0,"pcs.",0,"pcs.",0,"pcs.",0,"pcs.",0,"pcs.",0,"pcs.",0,"pcs.",0,"pcs.",null,null,1.25,1.25,0,133,24,109,1,1,0,1,1,"FDSB227 - Voice sounder beacon base, White Light, High Intensity"]
[null,"FDSB227 - Voice sounder beacon base, White Light, Medium Intensity",0,"pcs.",0,"pcs.",0,"pcs.",0,"pcs.",0,"pcs.",0,"pcs.",0,"pcs.",0,"pcs.",null,null,1.25,1.25,0,83,24,59,1,1,0,1,1,"FDSB227 - Voice sounder beacon base, White Light, Medium Intensity"]
[null,"FDSB227 - Voice sounder beacon base, White Light, Low Intensity",0,"pcs.",0,"pcs.",0,"pcs.",0,"pcs.",0,"pcs.",0,"pcs.",0,"pcs.",0,"pcs.",null,null,1.25,1.25,0,50,24,26,1,1,0,1,1,"FDSB227 - Voice sounder beacon base, White Light, Low Intensity"]
[null,"FDSB227 - Voice sounder beacon base, White Light, Indicator Mode",0,"pcs.",0,"pcs.",0,"pcs.",0,"pcs.",0,"pcs.",0,"pcs.",0,"pcs.",0,"pcs.",null,null,1.25,1.25,0,33,24,9,1,1,0,1,0,"FDSB227 - Voice sounder beacon base, White Light, Indicator Mode"]
[{"$nulls":20},0,null,null,0,{"$nulls":7},0]
[{"$nulls":20},0,null,null,0,{"$nulls":7},0]
[{"$nulls":20},0,null,null,0,{"$nulls":7},0]
[{"$nulls":20},0,null,null,0,{"$nulls":7},0]
[{"$nulls":20},0,null,null,0,{"$nulls":7},0]
[{"$nulls":20},0,null,null,0,{"$nulls":7},0]
[{"$nulls":20},0,null,null,0,{"$nulls":7},0]
[{"$nulls":20},0,null,null,0,{"$nulls":7},0]
[{"$nulls":20},0,null,null,0,{"$nulls":7},0]
[{"$nulls":20},0,null,null,0,{"$nulls":7},{"$f":"B276","v":0}]
[null,"External AI-Control",{"$nulls":29},"External AI-Control"]
[null,"FDAI9x - Ext. AI-Control",0,"pcs.",0,"pcs.",0,"pcs.",0,"pcs.",0,"pcs.",0,"pcs.",0,"pcs.",0,"pcs.",null,null,0,0,0,1,1,0,0,0,0,0,0,"FDAI9x - Ext. AI-Control"]
[{"$nulls":31},0]
[{"$nulls":20},0,null,null,0,{"$nulls":7},0]
[{"$nulls":20},0,null,null,0,{"$nulls":7},0]
[{"$nulls":20},0,null,null,0,{"$nulls":7},0]
[{"$nulls":20},0,null,null,0,{"$nulls":7},0]
[{"$nulls":20},0,null,null,0,{"$nulls":7},0]
[{"$nulls":20},0,null,null,0,{"$nulls":7},0]
[{"$nulls":20},0,null,null,0,{"$nulls":7},0]
[{"$nulls":20},0,null,null,0,{"$nulls":7},0]
[{"$nulls":20},0,null,null,0,{"$nulls":7},0]
[{"$nulls":20},0,null,null,0,{"$nulls":7},0]
[{"$nulls":20},0,null,null,0,{"$nulls":7},0]
[{"$nulls":20},0,null,null,0,{"$nulls":7},0]
[null,"Operation and indication devices",{"$nulls":29},"Operation and indication devices"]
[null,"FT2010 (supply over C-NET) - FRT",0,"pcs.",0,"pcs.",0,"pcs.",0,"pcs.",0,"pcs.",0,"pcs.",0,"pcs.",0,"pcs.",null,null,20,20,0,160,160,0,1,1,0,0,0,"FT2010 (supply over C-NET) - FRT"]
[null,"FT2010 (with external supply) - FRT",0,"pcs.",0,"pcs.",0,"pcs.",0,"pcs.",0,"pcs.",0,"pcs.",0,"pcs.",0,"pcs.",null,null,20,20,0,20,20,0,1,1,0,0,0,"FT2010 (with external supply) - FRT"]
[null,"FT2011 (supply over C-NET) - FRD",0,"pcs.",0,"pcs.",0,"pcs.",0,"pcs.",0,"pcs.",0,"pcs.",0,"pcs.",0,"pcs.",null,null,20,20,0,160,160,0,1,1,0,0,0,"FT2011 (supply over C-NET) - FRD"]
[null,"FT2011 (with external supply) - FRD",0,"pcs.",0,"pcs.",0,"pcs.",0,"pcs.",0,"pcs.",0,"pcs.",0,"pcs.",0,"pcs.",null,null,20,20,0,20,20,0,1,1,0,0,0,"FT2011 (with external supply) - FRD"]
[null,"FDCAI221 - Addressable alarm indicator",0,"pcs.",0,"pcs.",0,"pcs.",0,"pcs.",0,"pcs.",0,"pcs.",0,"pcs.",0,"pcs.",null,null,1,1,0,1,1,0,1,1,0,0,0,"FDCAI221 - Addressable alarm indicator"]
[]
[]
[]
[]
[{"$nulls":31},{"$f":"B302","v":0}]
[{"$nulls":31},0]
[{"$nulls":31},0]
[{"$nulls":31},0]
[{"$nulls":31},0]
[{"$nulls":31},0]
[{"$nulls":31},0]
[{"$nulls":31},0]
[{"$nulls":31},0]
[{"$nulls":31},0]
[]
[]
[]
[null,"Reserve for new devices"]
[null,"!! Do not fill in new lines !! "]
[null,"!! Problem with indirect links !!"]
{"$rows_empty":14}
[null,"Intrinsically safe stub lines 1 (Ex)  -  Line capacitance max. 82nF, line inductance max. 2.3mH, line resistance max. 50 Ohm",{"$nulls":29},{"$f":"B332","v":"Intrinsically safe stub lines 1 (Ex)  -  Line capacitance max. 82nF, line inductance max. 2.3mH, line resistance max. 50 Ohm"}]
[null,"FDCL221-Ex - Line adaptor Ex",{"$nulls":29},"FDCL221-Ex - Line adaptor Ex"]
[null,"OOH740-A9-Ex - Neural fire detector Ex",0,"Stk.",0,"Stk.",0,"Stk.",0,"Stk.",0,"Stk.",0,"Stk.",0,"Stk.",0,"Stk.",null,null,{"$f":"V334+W334","v":1.25},1.25,0,{"$f":"Y334+Z334","v":1.25},1.25,0,0,1,1,0,0,"OOH740-A9-Ex - Neural fire detector Ex"]
[null,"FDM223-Ex - Manual call point Ex",0,"Stk.",0,"Stk.",0,"Stk.",0,"Stk.",0,"Stk.",0,"Stk.",0,"Stk.",0,"Stk.",null,null,{"$f":"V335+W335","v":1.25},1.25,0,{"$f":"Y335+Z335","v":1.25},1.25,0,0,1,1,0,0,"FDM223-Ex - Manual call point Ex"]
[{"$nulls":31},0]
[{"$nulls":31},0]
[{"$nulls":31},0]
[{"$nulls":31},0]
[{"$nulls":31},0]
[{"$nulls":31},0]
[null,"Ex-Line Adaptor (FDCL221-Ex)",false,null,false,null,false,null,false,null,false,null,false,null,false,null,false,{"$nulls":3},{"$f":"V342+W342","v":10},10,0,{"$f":"Y342+Z342","v":10},10,0,0,1,0,0,0,{"$f":"B341","v":0}]
{"$rows_empty":8}
[null,"Intrinsically safe stub lines 2 (Ex)  -  Line capacitance max. 82nF, line inductance max. 2.3mH, line resistance max. 50 Ohm",{"$nulls":29},{"$f":"B351","v":"Intrinsically safe stub lines 2 (Ex)  -  Line capacitance max. 82nF, line inductance max. 2.3mH, line resistance max. 50 Ohm"}]
[null,"FDCL221-Ex - Line adaptor Ex",{"$nulls":29},"FDCL221-Ex - Line adaptor Ex"]
[null,"OOH740-A9-Ex - Neural fire detector Ex",0,"Stk.",null,null,0,"Stk.",null,null,0,"Stk.",null,null,0,"Stk.",{"$nulls":4},{"$f":"V353+W353","v":1.25},1.25,0,{"$f":"Y353+Z353","v":1.25},1.25,0,0,1,1,0,0,"OOH740-A9-Ex - Neural fire detector Ex"]
[null,"FDM223-Ex - Manual call point Ex",0,"Stk.",null,null,0,"Stk.",null,null,0,"Stk.",null,null,0,"Stk.",{"$nulls":4},{"$f":"V354+W354","v":1.25},1.25,0,{"$f":"Y354+Z354","v":1.25},1.25,0,0,1,1,0,0,"FDM223-Ex - Manual call point Ex"]
[null,null,0,{"$nulls":3},0,{"$nulls":3},0,{"$nulls":3},0,{"$nulls":16},0]
[{"$nulls":31},0]
[{"$nulls":31},0]
[{"$nulls":31},0]
[{"$nulls":31},0]
[{"$nulls":31},0]
[null,"Ex-Line Adaptor (FDCL221-Ex)",false,null,false,null,false,null,false,null,false,null,false,null,false,null,false,{"$nulls":3},{"$f":"V361+W361","v":10},10,0,{"$f":"Y361+Z361","v":10},10,0,0,1,0,0,0]
{"$rows_empty":13}
[null,"Reserve for new devices"]
[null,"!! Do not fill in new lines !! "]
[null,"!! Problem with indirect links !!"]
[]
[]
[null,"End line calculation"]
{"$rows_empty":9}
[null,"Plausibility wireless device (FDCW221)",true,null,true,null,true,null,true,null,true,null,true,null,true,null,true]
[null,null,true]
[null,"Plausibility SWiNG wireless device (FDCW241)",true,null,true,null,true,null,true,null,true,null,true,null,true,null,true]
[null,null,true]
[null,"Amount of FDCIO Input/Output module per loop / stub",0,null,0,null,0,null,0,null,0,null,0,null,0,null,0]
[null,"Amount of FDCIO Input/Output module per line card",0,"pcs"]
[null,"Amount of FT2001 operation devices per loop / stub",0,null,0,null,0,null,0,null,0,null,0,null,0,null,0]
[null,"Amount of FT2001 operation devices per loop / stub) per line card",0,"pcs"]
[null,"Amount of FRT / FRD operation devices per loop / stub",0,null,0,null,0,null,0,null,0,null,0,null,0,null,0]
[null,"Amount of FRT / FRD operation devices .per line card",0,"pcs"]
[null,null,0]
[null,"Plausibility Ex-Adapter (FDCL221-Ex)",true,null,true,null,true,null,true,null,true,null,true,null,true,null,true]
[null,null,true]
[]
["Input cable characteristics"]
[]
[null,"Cable characteristics",{"$f":"$C$80","v":"Line card (C-NET) FCL2001-A1"}]
[null,null,{"$f":"C$82","v":"Stub1_1"},null,{"$f":"E$82","v":"Stub1_2"},null,{"$f":"G$82","v":"Stub2_1"},null,{"$f":"I$82","v":"Stub2_2"},null,{"$f":"K$82","v":"Stub3_1"},null,{"$f":"M$82","v":"Stub3_2"},null,{"$f":"O$82","v":"Stub4_1"},null,{"$f":"Q$82","v":"Stub4_2"}]
[null,"Cable length for line resistor",1,"m",1,"m",1,"m",1,"m",1,"m",1,"m",1,"m",1,"m"]
[null,"Cable length for line capacity",1,"m",1,"m",1,"m",1,"m",1,"m",1,"m",1,"m",1,"m"]
[null,"Resistance value R' of cable",70,"Ohm/km",70,"Ohm/km",70,"Ohm/km",70,"Ohm/km",70,"Ohm/km",70,"Ohm/km",70,"Ohm/km",70,"Ohm/km"]
[null,"Capacitance value Cs' of cable",70,"nF/km",70,"nF/km",70,"nF/km",70,"nF/km",70,"nF/km",70,"nF/km",70,"nF/km",70,"nF/km"]
[]
[]
[null,"Cable type"]
[null,"Enter cable parameter manually"]
{"$rows_empty":14}
[null,null,"Choose Cal.",null,"Choose Cal.",null,"Choose Cal.",null,"Choose Cal.",null,"Choose Cal.",null,"Choose Cal.",null,"Choose Cal.",null,"Choose Cal."]
[null,null,"Worst case",null,"Worst case",null,"Worst case",null,"Worst case",null,"Worst case",null,"Worst case",null,"Worst case",null,"Worst case"]
[]
[]
[]
[null,"Calculation characteristics",{"$f":"$C$80","v":"Line card (C-NET) FCL2001-A1"}]
[]
[null,null,{"$f":"C$82","v":"Stub1_1"},null,{"$f":"E$82","v":"Stub1_2"},null,{"$f":"G$82","v":"Stub2_1"},null,{"$f":"I$82","v":"Stub2_2"},null,{"$f":"K$82","v":"Stub3_1"},null,{"$f":"M$82","v":"Stub3_2"},null,{"$f":"O$82","v":"Stub4_1"},null,{"$f":"Q$82","v":"Stub4_2"}]
[null,"Cable length at start to first device",1,"m",1,"m",1,"m",1,"m",1,"m",1,"m",1,"m",1,"m"]
[]
[null,"Cable length at end to last device",0,"m",0,"m",0,"m",0,"m",0,"m",0,"m",0,"m",0,"m"]
[]
[null,"Average distance between devices",{"v":0,"d":"0.0"},"m",{"v":0,"d":"0.0"},"m",{"v":0,"d":"0.0"},"m",{"v":0,"d":"0.0"},"m",{"v":0,"d":"0.0"},"m",{"v":0,"d":"0.0"},"m",{"v":0,"d":"0.0"},"m",{"v":0,"d":"0.0"},"m"]
[null,"Average distance between low MK devices",{"v":1e-05,"d":"0.0"},"m",{"v":0,"d":"0.0"},"m",{"v":3.4482758620689656E-7,"d":"0.0"},"m",{"v":0,"d":"0.0"},"m",{"v":0.034482758620689655,"d":"0.0"},"m",{"v":0,"d":"0.0"},"m",{"v":3.4482758620689657E-5,"d":"0.0"},"m",{"v":0,"d":"0.0"},"m"]
[null,"Average distance between high MK devices",{"v":1e-05,"d":"0.0"},"m",{"v":0,"d":"0.0"},"m",{"v":1.1111111111111112E-6,"d":"0.0"},"m",{"v":0,"d":"0.0"},"m",{"v":0.1111111111111111,"d":"0.1"},"m",{"v":0,"d":"0.0"},"m",{"v":1.1111111111111112E-4,"d":"0.0"},"m",{"v":0,"d":"0.0"},"m"]
[]
[]
[]
[null,"Plausibility cable lengths",true,null,true,null,true,null,true,null,true,null,true,null,true,null,true]
[null,null,true]
{"$rows_empty":24}
["Analysis of configuration"]
[]
[null,"Device information",{"$f":"$C$80","v":"Line card (C-NET) FCL2001-A1"}]
[null,null,{"$f":"C$82","v":"Stub1_1"},null,{"$f":"E$82","v":"Stub1_2"},null,{"$f":"G$82","v":"Stub2_1"},null,{"$f":"I$82","v":"Stub2_2"},null,{"$f":"K$82","v":"Stub3_1"},null,{"$f":"M$82","v":"Stub3_2"},null,{"$f":"O$82","v":"Stub4_1"},null,{"$f":"Q$82","v":"Stub4_2"}]
[]
[null,"Adressindex (AK) per Loop / Stub",0,null,0,null,0,null,0,null,0,null,0,null,0,null,0]
[null,"Total Adressindex (AK) per Line Card",0]
[]
[]
[null,"Isolator index (TK)",0,null,0,null,0,null,0,null,0,null,0,null,0,null,0]
[null,"Limit for MK Low/High decision",15,null,15,null,15,null,15,null,15,null,15,null,15,null,15]
[null,"Amount Low MK devices (Adressindex)",0,"pcs",0,"pcs",0,"pcs",0,"pcs",0,"pcs",0,"pcs",0,"pcs",0,"pcs"]
[null,"Amount High MK devices (Adressindex)",0,"pcs",0,"pcs",0,"pcs",0,"pcs",0,"pcs",0,"pcs",0,"pcs",0,"pcs"]
[null,"Amount Total MK devices (Adressindex)",0,"pcs",0,"pcs",0,"pcs",0,"pcs",0,"pcs",0,"pcs",0,"pcs",0,"pcs"]
[]
[]
[null,"Quietindex (RK) per Loop / Stub",0,null,0,null,0,null,0,null,0,null,0,null,0,null,0]
[null,"Deviceindex (MK) per Loop / Stub",0,null,0,null,0,null,0,null,0,null,0,null,0,null,0]
[null,"Total Deviceindex (MK) per Line Card",0]
[]
[]
[]
[null,"Ex-Line calculation"]
[null,"Capacitance Extra Load Ex-Line 1",0,"nF",0,"nF",0,"nF",0,"nF",0,"nF",0,"nF",0,"nF",0,"nF"]
[null,"Minimum Line Voltage Ex-Line 1 (less than 19V)",{"v":0,"d":"0.00"},"V",{"v":0,"d":"0.00"},"V",{"v":0,"d":"0.00"},"V",{"v":0,"d":"0.00"},"V",{"v":0,"d":"0.00"},"V",{"v":0,"d":"0.00"},"V",{"v":0,"d":"0.00"},"V",{"v":0,"d":"0.00"},"V"]
[null,"Capacitance Extra Load Ex-Line 2",0,"nF",0,"nF",0,"nF",0,"nF",0,"nF",0,"nF",0,"nF",0,"nF"]
[null,"Minimum Line Voltage Ex-Line 2 (less than 19V)",{"v":0,"d":"0.00"},"V",{"v":0,"d":"0.00"},"V",{"v":0,"d":"0.00"},"V",{"v":0,"d":"0.00"},"V",{"v":0,"d":"0.00"},"V",{"v":0,"d":"0.00"},"V",{"v":0,"d":"0.00"},"V",{"v":0,"d":"0.00"},"V"]
[null,"Alarm Indicator Current for Ex-Line (only if active)",0,"A",0,"A",0,"A",0,"A",0,"A",0,"A",0,"A",0,"A"]
[]
[]
[]
[null,"Minimal Line voltage"]
[null,"Is minimal Device Voltage 16V",false,null,false,null,false,null,false,null,false,null,false,null,false,null,false]
[null,"Minimal Device Voltage",{"v":12,"d":"12.00"},"V",{"v":12,"d":"12.00"},"V",{"v":12,"d":"12.00"},"V",{"v":12,"d":"12.00"},"V",{"v":12,"d":"12.00"},"V",{"v":12,"d":"12.00"},"V",{"v":12,"d":"12.00"},"V",{"v":12,"d":"12.00"},"V"]
[]
[]
[]
[null,"Additional Line information"]
[null,"Leak current",0.016,"A",0.012,"A",0.016,"A",0.012,"A",0.016,"A",0.012,"A",0.016,"A",0.012,"A"]
[null,"Alarm Indicator Current",{"v":0.005333333333333333,"d":"0.005"},"A",{"v":0.005333333333333333,"d":"0.005"},"A",{"v":0.005333333333333333,"d":"0.005"},"A",{"v":0.005333333333333333,"d":"0.005"},"A",{"v":0.005333333333333333,"d":"0.005"},"A",{"v":0.005333333333333333,"d":"0.005"},"A",{"v":0.005333333333333333,"d":"0.005"},"A",{"v":0.005333333333333333,"d":"0.005"},"A"]
[null,"Maximum Cable Length at Start/End for Low MK devices",900,"m",1,"m",900,"m",1,"m",899,"m",1,"m",899,"m",1,"m"]
[null,"Maximum Cable Length at Start/End for High MK devices",900,"m",1,"m",900,"m",1,"m",899,"m",1,"m",899,"m",1,"m"]
[null,"Product Rdet*TK (with High ohmic FET isolator)",{"v":0,"d":"0.0"},"Ohm",{"v":0,"d":"0.0"},"Ohm",{"v":0,"d":"0.0"},"Ohm",{"v":0,"d":"0.0"},"Ohm",{"v":0,"d":"0.0"},"Ohm",{"v":0,"d":"0.0"},"Ohm",{"v":0,"d":"0.0"},"Ohm",{"v":0,"d":"0.0"},"Ohm"]
[null,"Product Rdet*TK (with High and Low ohmic FET isolator)",{"v":0,"d":"0.0"},"Ohm",{"v":0,"d":"0.0"},"Ohm",{"v":0,"d":"0.0"},"Ohm",{"v":0,"d":"0.0"},"Ohm",{"v":0,"d":"0.0"},"Ohm",{"v":0,"d":"0.0"},"Ohm",{"v":0,"d":"0.0"},"Ohm",{"v":0,"d":"0.0"},"Ohm"]
[]
[]
[]
[]
[]
[null,"Alarm calculation",{"$f":"$C$80","v":"Line card (C-NET) FCL2001-A1"}]
[null,null,{"$f":"C$82","v":"Stub1_1"},null,{"$f":"E$82","v":"Stub1_2"},null,{"$f":"G$82","v":"Stub2_1"},null,{"$f":"I$82","v":"Stub2_2"},null,{"$f":"K$82","v":"Stub3_1"},null,{"$f":"M$82","v":"Stub3_2"},null,{"$f":"O$82","v":"Stub4_1"},null,{"$f":"Q$82","v":"Stub4_2"}]
[]
[null,"Alarm Voltage at Line Start, 1st calculation",{"v":0,"d":"0.00"},"V",{"v":0,"d":"0.00"},"V",{"v":0,"d":"0.00"},"V",{"v":0,"d":"0.00"},"V",{"v":0,"d":"0.00"},"V",{"v":0,"d":"0.00"},"V",{"v":0,"d":"0.00"},"V",{"v":0,"d":"0.00"},"V"]
[null,"Alarm Voltage at Line before Cable, 1st calculation",{"v":0,"d":"0.00"},"V",{"v":0,"d":"0.00"},"V",{"v":0,"d":"0.00"},"V",{"v":0,"d":"0.00"},"V",{"v":0,"d":"0.00"},"V",{"v":0,"d":"0.00"},"V",{"v":0,"d":"0.00"},"V",{"v":0,"d":"0.00"},"V"]
[null,"Cable resistor between last device and start line",21.6,"Ohm",{"v":0.125,"d":"0.1"},"Ohm",21.6,"Ohm",{"v":0.125,"d":"0.1"},"Ohm",{"v":21.576,"d":"21.6"},"Ohm",{"v":0.125,"d":"0.1"},"Ohm",{"v":21.576,"d":"21.6"},"Ohm",{"v":0.125,"d":"0.1"},"Ohm"]
[null,"Alarm Current, 1st calculation",{"v":0,"d":"0.000"},"A",{"v":0,"d":"0.000"},"A",{"v":0,"d":"0.000"},"A",{"v":0,"d":"0.000"},"A",{"v":0,"d":"0.000"},"A",{"v":0,"d":"0.000"},"A",{"v":0,"d":"0.000"},"A",{"v":0,"d":"0.000"},"A"]
[null,"Alarm Voltage at Line Start after recursion",{"v":0,"d":"0.00"},"V",{"v":0,"d":"0.00"},"V",{"v":0,"d":"0.00"},"V",{"v":0,"d":"0.00"},"V",{"v":0,"d":"0.00"},"V",{"v":0,"d":"0.00"},"V",{"v":0,"d":"0.00"},"V",{"v":0,"d":"0.00"},"V"]
[null,"Alarm Voltage at Line End after recursion",{"v":0,"d":"0.00"},"V",{"v":0,"d":"0.00"},"V",{"v":0,"d":"0.00"},"V",{"v":0,"d":"0.00"},"V",{"v":0,"d":"0.00"},"V",{"v":0,"d":"0.00"},"V",{"v":0,"d":"0.00"},"V",{"v":0,"d":"0.00"},"V"]
[]
[null,"Maximum alarm current per Loop / Stub",0.5,"A",0.5,"A",0.5,"A",0.5,"A",0.5,"A",0.5,"A",0.5,"A",0.5,"A"]
[null,"Alarm current per Loop / Stub",{"v":0,"d":"0.000"},"A",{"v":0,"d":"0.000"},"A",{"v":0,"d":"0.000"},"A",{"v":0,"d":"0.000"},"A",{"v":0,"d":"0.000"},"A",{"v":0,"d":"0.000"},"A",{"v":0,"d":"0.000"},"A",{"v":0,"d":"0.000"},"A"]
[]
[null,"Maximum alarm current per Line Card",{"v":0.5,"d":" 0.5 A"}]
[null,"Total alarm current per Line Card",{"v":0.5,"d":" 0.500 A"}]
[null,"Current consumption alarm (at Panel by 24V)",{"v":0.039,"d":" 0.039 A"}]
[]
[]
[null,"Quiet calculation",{"$f":"$C$80","v":"Line card (C-NET) FCL2001-A1"}]
[null,null,{"$f":"C$82","v":"Stub1_1"},null,{"$f":"E$82","v":"Stub1_2"},null,{"$f":"G$82","v":"Stub2_1"},null,{"$f":"I$82","v":"Stub2_2"},null,{"$f":"K$82","v":"Stub3_1"},null,{"$f":"M$82","v":"Stub3_2"},null,{"$f":"O$82","v":"Stub4_1"},null,{"$f":"Q$82","v":"Stub4_2"}]
[null,"Quiet Voltage at Line Start, 1st calculation",{"v":0,"d":"0.00"},"V",{"v":0,"d":"0.00"},"V",{"v":0,"d":"0.00"},"V",{"v":0,"d":"0.00"},"V",{"v":0,"d":"0.00"},"V",{"v":0,"d":"0.00"},"V",{"v":0,"d":"0.00"},"V",{"v":0,"d":"0.00"},"V"]
[null,"Quiet Voltage at Line End after recursion",{"v":0,"d":"0.00"},"V",{"v":0,"d":"0.00"},"V",{"v":0,"d":"0.00"},"V",{"v":0,"d":"0.00"},"V",{"v":0,"d":"0.00"},"V",{"v":0,"d":"0.00"},"V",{"v":0,"d":"0.00"},"V",{"v":0,"d":"0.00"},"V"]
[null,"Quiet current per Loop / Stub",{"v":0,"d":"0.000"},"A",{"v":0,"d":"0.000"},"A",{"v":0,"d":"0.000"},"A",{"v":0,"d":"0.000"},"A",{"v":0,"d":"0.000"},"A",{"v":0,"d":"0.000"},"A",{"v":0,"d":"0.000"},"A",{"v":0,"d":"0.000"},"A"]
[]
[null,"Total quiet current per Line Card",{"v":0,"d":" 0.000 A"}]
[null,"Current consumption quiet (at Panel by 24V)",{"v":0.039,"d":" 0.039 A"}]
[]
[]
[]
[]
[]
[null,"Cabling information",{"$f":"$C$80","v":"Line card (C-NET) FCL2001-A1"}]
[null,null,{"$f":"C$82","v":"Stub1_1"},null,{"$f":"E$82","v":"Stub1_2"},null,{"$f":"G$82","v":"Stub2_1"},null,{"$f":"I$82","v":"Stub2_2"},null,{"$f":"K$82","v":"Stub3_1"},null,{"$f":"M$82","v":"Stub3_2"},null,{"$f":"O$82","v":"Stub4_1"},null,{"$f":"Q$82","v":"Stub4_2"}]
[null,"Line Resistors"]
[null,"Resistor load per Loop / Stub",{"v":0.07,"d":"0.1"},"Ohm",{"v":0.07,"d":"0.1"},"Ohm",{"v":0.07,"d":"0.1"},"Ohm",{"v":0.07,"d":"0.1"},"Ohm",{"v":0.07,"d":"0.1"},"Ohm",{"v":0.07,"d":"0.1"},"Ohm",{"v":0.07,"d":"0.1"},"Ohm",{"v":0.07,"d":"0.1"},"Ohm"]
[null,"Additional possible resistor load per Loop / Stub (approximate estimate, dRmax)",{"v":0,"d":"0.0"},"Ohm",{"v":0,"d":"0.0"},"Ohm",{"v":0,"d":"0.0"},"Ohm",{"v":0,"d":"0.0"},"Ohm",{"v":0,"d":"0.0"},"Ohm",{"v":0,"d":"0.0"},"Ohm",{"v":0,"d":"0.0"},"Ohm",{"v":0,"d":"0.0"},"Ohm"]
[null,"Additional possible cable length per Loop / Stub (approximate estimate)",0,"m",0,"m",0,"m",0,"m",0,"m",0,"m",0,"m",0,"m"]
[null,"Additional possible MK per Loop / Stub (approximate estimate)",0,null,0,null,0,null,0,null,0,null,0,null,0,null,0]
[]
[null,"Max. possible line resistor (only with High ohmic FET isolator \"old formula\")",{"v":240,"d":"240.0"},"Ohm",{"v":240,"d":"240.0"},"Ohm",{"v":240,"d":"240.0"},"Ohm",{"v":240,"d":"240.0"},"Ohm",{"v":240,"d":"240.0"},"Ohm",{"v":240,"d":"240.0"},"Ohm",{"v":240,"d":"240.0"},"Ohm",{"v":240,"d":"240.0"},"Ohm"]
[null,"Max. possible line resistor (with High and Low ohmic FET isolator \"old formula\")",{"v":240,"d":"240.0"},"Ohm",{"v":240,"d":"240.0"},"Ohm",{"v":240,"d":"240.0"},"Ohm",{"v":240,"d":"240.0"},"Ohm",{"v":240,"d":"240.0"},"Ohm",{"v":240,"d":"240.0"},"Ohm",{"v":240,"d":"240.0"},"Ohm",{"v":240,"d":"240.0"},"Ohm"]
[]
[]
[null,"Line Capacitance"]
[null,"Maximum line capacitive per Loop / Stub",750,"nF",750,"nF",750,"nF",750,"nF",750,"nF",750,"nF",750,"nF",750,"nF"]
[null,"Cable capacitive per Loop / Stub",0.07,"nF",0.07,"nF",0.07,"nF",0.07,"nF",0.07,"nF",0.07,"nF",0.07,"nF",0.07,"nF"]
[null,"Capacitive extra load of devices per Loop / Stub",0,"nF",0,"nF",0,"nF",0,"nF",0,"nF",0,"nF",0,"nF",0,"nF"]
[]
[null,"Maximum line capacitive per Line Card",{"v":1000,"d":" 1,000 nF"}]
[null,"Total capacitive load per Line Card",{"v":0.28,"d":" 0 nF"}]
[]
[]
[null,"Refresh Check"]
[null,"Refresh Calculation Necessary",true]
[null,"Configuration Check",true]
[null,"Is Line Configuration OK",true,null,true,null,true,null,true,null,true,null,true,null,true,null,true]
[null,"Is Card Configuration OK",true]
[null,"Button Text"]
[null,"Button Text","Press Button to refresh calculation"]
[null,"Calculation Check","Press Button to refresh calculation"]
[null,"Is Line calculation possible (wrong type at input fields)",true,null,true,null,true,null,true,null,true,null,true,null,true,null,true]
[null,null,true]

{"sheet":"FDnet_Constants","index":7,"n_rows":421,"n_cols":5,"rows_kept":421,"hidden":true}
["General characteristic values"]
[]
["Max. cablelength resistor","maxLengthR",3300,"m","240 Ohm = 72 Ohm/km * 3300m (MP1.1 only 2500m)"]
["Max. cablelength capacity","maxLengthC",5000,"m","(no restriction, value could be higher)"]
["Max. Adressindex per Stub","MaxAKStub",64,"Device"]
["Max. Adressindex per Loop","MaxAKLoop",126,"Device","(restriction trough startup time)"]
["Max. Adressindex per Module","MaxAKModule",252,"Device"]
["Max. current per Module","Imax",0.5,"A","(distribution free between Loop and Stub)"]
["Max. current per Module","ImaxStation",0.883,"A","(@ 24V, inkl. Wirkungsgrad DC/DC)"]
["Max. leakcurrent per Loop/Stub","Ileak",0.008,"A"]
["Max. leakcurrent per Module","IleakModule",0.022,"A"]
["Min. line voltage","Vline_min",31,"V"]
["Min. detector voltage","Vdet_min",12,"V"]
["Min. beacon voltage AD18","Vdet_min_AD18",16,"V"]
["Nom. Answer voltage","Vans",6,"V"]
["Detector Current","Idet",0.00025,"A"]
["Operation indicator factor","OperationIndicatorFactor",0.72,null,"Current for Operation indicator ~180uA -> 180uA/250uA"]
["Internal alarm indicator current","I_Iai",0.0002,"A"]
["Amount of Internal alarm indicators","N_Iai",10]
["External alarm indicator current","I_Eai",0.0002,"A"]
["Amount of External alarm indicators","N_Eai",10]
["Steady on Internal alarm indicator current","I_IaiSteadyOn",0.0012,"A","3ms/25ms*10mA (LED is every 25ms for 3ms active, current 10mA)"]
["Amount of steadyOn internal alarm indicators (GB)","N_IaiSteadyOn_GB",32,null,"GB standard demand 32 devices on alarm"]
["Amount of steadyOn internal alarm indicators (operation indicator)","N_IaiSteadyOn_OI",10,null,"max. 10 devices on alarm"]
["Duty Cycle","DC",0.75]
["Max. answer current resistor","Rans",250,"Ohm","250 Ohm = (5.5V / 15mA) - 120 Ohm / resistor with Detectors FET"]
["Max. cable resistor","Rcbl",240,"Ohm","240 Ohm = 72 Ohm/km * 3300m (MP1.1 only 180 Ohm)"]
["Max. FET resistor","Rdet",0.2,"Ohm"]
["Max. FET resistor for low Typ","Rdet_low",0.1,"Ohm"]
["Increase capacity from (Rc)","IncCapRc",50,"Ohm"]
["Capacity >Rc","CmaxGreatRc",500,"nF"]
["Capacity <Rc","CmaxSmalRc",750,"nF"]
["Max. capacity per Module","MaxC",1000,"nF"]
["Max. numbers of wireless device per gateway","MaxRadioDevice",30,"Device"]
["Max. numbers of wireless device per gateway SWiNG","MaxSwingDevice",30,"Device"]
["Maximum number of FDCIO per Line Card","MaxFDCIO_Device",50,"Device"]
["Maximum number of FT2001 per Line Card","MaxFT2001_Device",20,"Device"]
["Maximum number of FRT / FRD per Line Card","MaxFRT_FRD_Device",8,"Device"]
[]
[]
["P2 Ex-Stub characteristic values"]
["Max. leakcurrent per Ex-Stub","IleakEx",4.3E-3,"A","Ex-Stub rules and calculation basis"]
["Min. detector voltage with FDCL-Ex","VdetEx_min",13,"V","- FDCL221-Ex together with device load is added to line"]
["Max. ex line cable res. (incl. Barriere)","RlEx",440,"Ohm","\n- from the load a minimum FDCL22-1Ex input voltage is resulting"]
["Max. loop cable resistance Ex","RansEx",190,"Ohm","- line parameters of Ex-Line need not be specified,"]
["Ex-transformer current ratio","ConvIEx",1.25,null,"  worst case values are considered  (50 Ohm, 82nF)"]
["Ex-transformer voltage ratio","ConvUEx",1.25,null,"- max. line resistance before FDCL221-Ex is 190 Ohm"]
["Ex-voltagedrop_trafo","VdropEx",1.4,"V","- up to 2 FDCL221-Ex per Loop are possible, only 1 on a stub"]
["Capacitive Load FDCL221-Ex","C_FDCL",200,"nF","- FDCL221-Ex adds 200nF capacitive load to the line"]
["Upper Limit for minimal FDCL221-Ex input voltage","V_FDCL_ul",19,"V","- FDCL221-Ex minimum input voltage must be below 19V (output clamp)"]
["Max. number of detectors in Alarm on one FDCL221-Ex","N_AI_Ex",3,null,"- 10% of allowed devices on a stub; accepted by PM for CN"]
["Max. number of detectors at adapter","MaxExDevice",20]
[]
["Formula for determination of minimal Fdnet line voltage with a connected Fdnet Ex-stub:"]
[{"$nulls":4},"Vline_min may not be larger than V_FDCL_ul, otherwise"]
[{"$nulls":4},"the input is clipped if to avoid unsafe voltages at the Ex-line side"]
{"$rows_empty":306}
[null,null,true]
[]
[null,null,true]
[]
[]
[]
[]
[]
[null,null,0]
[null,null,0]
{"$rows_empty":48}
[null,null,true]

{"sheet":"Panel_comp","index":8,"n_rows":239,"n_cols":16,"rows_kept":239,"hidden":true}
["Abbreviations"]
["open, value tbd by R&D"]
["changeable field"]
["Data from input-output sheet"]
["calculation"]
["Measurement from R&D"]
[]
["General characteristic values"]
[]
[]
[]
[]
[]
["Max. Total Current of All Sounders",null,{"v":0.5,"d":"0.500"},"A","(@ 24V)"]
["Max. Current per Sounder Line",null,{"v":0.5,"d":"0.500"},"A","(@ 24V)"]
["Max. Current of Auxiliary Power",null,{"v":0.2,"d":"0.200"},"A","(@ 24V)"]
["Max. Current per Open Collector",null,{"v":0.1,"d":"0.100"},"A","(@ 24V)"]
["Max. RSxxx Modules",null,1,"pcs."]
["Max. I2C participants",null,16,"pcs."]
["Max. degrade mode participants",null,32,"pcs."]
["Max. Current of Each Output - Internal power",null,{"v":1,"d":"1.000"},"A","(@ 26.1V)"]
["Calculation of current consumption"]
[]
[null,null,"Load on local voltage, per unit",{"$nulls":5},"Quantity","Load on system voltage, total"]
[null,null,"I norm [A]","I alarm [A]","U [V]","n [%]","P norm [W]","P alarm [W]","Quant. [pcs]","I norm [A]","I alarm [A]","P norm [W]","P alarm [W]"]
[]
["Periphery board - C-NET"]
["Current consumption LC1",null,{"$f":"FC360_Panel!F89","v":0.039},{"$f":"FC360_Panel!H89","v":0.039},24,{"$f":"IF(21<E28,IF(E28<30,100%,80%),80%)","v":{"v":1,"d":"100%"}},{"$f":"C28*E28/F28","v":{"v":0.9359999999999999,"d":"0.94"}},{"$f":"D28*E28/F28","v":{"v":0.9359999999999999,"d":"0.94"}},{"$f":"IF(OR($C$109=1,$C$109=2,$C$109=3,$C$109=4),1,0)","v":1},null,null,{"$f":"G28*I28","v":{"v":0.9359999999999999,"d":"0.94"}},{"$f":"H28*I28","v":{"v":0.9359999999999999,"d":"0.94"}}]
["Current consumption LC2",null,{"$f":"FC360_Panel!F92","v":{"v":0.0390123564023536,"d":"0.039"}},{"$f":"FC360_Panel!H92","v":{"v":0.0390123564023536,"d":"0.039"}},24,{"$f":"IF(21<E29,IF(E29<30,100%,80%),80%)","v":{"v":1,"d":"100%"}},{"$f":"C29*E29/F29","v":{"v":0.9362965536564865,"d":"0.94"}},{"$f":"D29*E29/F29","v":{"v":0.9362965536564865,"d":"0.94"}},{"$f":"IF(OR($C$109=3,$C$109=4),1,0)","v":0},null,null,{"$f":"G29*I29","v":{"v":0,"d":"0.00"}},{"$f":"H29*I29","v":{"v":0,"d":"0.00"}}]
[]
[{"$nulls":11},{"$f":"L$25","v":"P norm [W]"},{"$f":"M$25","v":"P alarm [W]"}]
["Power consumption (Ex. Loop)",{"$nulls":10},{"$f":"SUM(L$28:L$29)","v":{"v":0.9359999999999999,"d":"0.936"}},{"$f":"SUM(M$28:M$29)","v":{"v":0.9359999999999999,"d":"0.936"}}]
[]
["Card cage"]
["Power consumption card cages 2 (push button \"Caculate\" for actual value)",{"$nulls":10},{"v":0,"d":"0.000"},{"v":0,"d":"0.000"}]
["Power consumption supply1 card cages 5  (push button \"Caculate\" for actual value)",{"$nulls":10},{"v":0,"d":"0.000"},{"v":0,"d":"0.000"}]
[]
[{"$nulls":11},{"$f":"L$25","v":"P norm [W]"},{"$f":"M$25","v":"P alarm [W]"}]
["Power consumption",{"$nulls":10},{"$f":"SUM(L$35:L$36)","v":{"v":0,"d":"0.000"}},{"$f":"SUM(M$35:M$36)","v":{"v":0,"d":"0.000"}}]
[]
["Periphery board - Input / Output"]
["Sounder Lines",null,{"$f":"C$25","v":"I norm [A]"},"I alarm [A]","U [V]","n [%]","P norm [W]","P alarm [W]","Quant. [pcs]","I norm [A]","I alarm [A]","P norm [W]","P alarm [W]"]
["Sounder line 1 (SOUND1)",null,{"$f":"FC360_Panel!F100","v":{"v":0,"d":"0.000"}},{"$f":"FC360_Panel!H100","v":{"v":0,"d":"0.000"}},24,{"$f":"IF(21<E43,IF(E43<30,100%,80%),80%)","v":{"v":1,"d":"100%"}},{"$f":"C43*E43/F43","v":{"v":0,"d":"0.00"}},{"$f":"D43*E43/F43","v":{"v":0,"d":"0.00"}},1,{"$f":"C43*I43","v":{"v":0,"d":"0.000"}},{"$f":"D43*I43","v":{"v":0,"d":"0.000"}},{"$f":"G43*I43","v":{"v":0,"d":"0.00"}},{"$f":"H43*I43","v":{"v":0,"d":"0.00"}}]
["Sounder line 2 (SOUND2)",null,{"$f":"FC360_Panel!F101","v":{"v":0,"d":"0.000"}},{"$f":"FC360_Panel!H101","v":{"v":0,"d":"0.000"}},24,{"$f":"IF(21<E44,IF(E44<30,100%,80%),80%)","v":{"v":1,"d":"100%"}},{"$f":"C44*E44/F44","v":{"v":0,"d":"0.00"}},{"$f":"D44*E44/F44","v":{"v":0,"d":"0.00"}},1,{"$f":"C44*I44","v":{"v":0,"d":"0.000"}},{"$f":"D44*I44","v":{"v":0,"d":"0.000"}},{"$f":"G44*I44","v":{"v":0,"d":"0.00"}},{"$f":"H44*I44","v":{"v":0,"d":"0.00"}}]
[]
[]
["Alarm & Fault Outputs",null,{"$f":"C$25","v":"I norm [A]"},"I alarm [A]","U [V]","n [%]","P norm [W]","P alarm [W]","Quant. [pcs]","I norm [A]","I alarm [A]","P norm [W]","P alarm [W]"]
["Output Alarm supervised (AL_OUT)",null,{"$f":"FC360_Panel!F104","v":{"v":0,"d":"0.000"}},{"$f":"FC360_Panel!H104","v":{"v":0,"d":"0.000"}},24,{"$f":"IF(21<E48,IF(E48<30,100%,80%),80%)","v":{"v":1,"d":"100%"}},{"$f":"C48*E48/F48","v":{"v":0,"d":"0.00"}},{"$f":"D48*E48/F48","v":{"v":0,"d":"0.00"}},{"$f":"IF(OR($C$109=1,$C$109=2,$C$109=3,$C$109=4),1,0)","v":1},{"$f":"C48*I48","v":{"v":0,"d":"0.000"}},{"$f":"D48*I48","v":{"v":0,"d":"0.000"}},{"$f":"G48*I48","v":{"v":0,"d":"0.00"}},{"$f":"H48*I48","v":{"v":0,"d":"0.00"}}]
["Output Fault supervised (FAU_OUT)",null,{"$f":"FC360_Panel!F105","v":{"v":0,"d":"0.000"}},{"$f":"FC360_Panel!H105","v":{"v":0,"d":"0.000"}},24,{"$f":"IF(21<E49,IF(E49<30,100%,80%),80%)","v":{"v":1,"d":"100%"}},{"$f":"C49*E49/F49","v":{"v":0,"d":"0.00"}},{"$f":"D49*E49/F49","v":{"v":0,"d":"0.00"}},{"$f":"$I$48","v":1},{"$f":"C49*I49","v":{"v":0,"d":"0.000"}},{"$f":"D49*I49","v":{"v":0,"d":"0.000"}},{"$f":"G49*I49","v":{"v":0,"d":"0.00"}},{"$f":"H49*I49","v":{"v":0,"d":"0.00"}}]
[]
[]
["Auxiliary Power",null,{"$f":"C$25","v":"I norm [A]"},"I alarm [A]","U [V]","n [%]","P norm [W]","P alarm [W]","Quant. [pcs]","I norm [A]","I alarm [A]","P norm [W]","P alarm [W]"]
["Total load of auxiliary power",null,{"$f":"FC360_Panel!F108","v":{"v":0,"d":"0.000"}},{"$f":"FC360_Panel!H108","v":{"v":0,"d":"0.000"}},24,{"$f":"IF(21<E53,IF(E53<30,100%,80%),80%)","v":{"v":1,"d":"100%"}},{"$f":"C53*E53/F53","v":{"v":0,"d":"0.00"}},{"$f":"D53*E53/F53","v":{"v":0,"d":"0.00"}},{"$f":"IF(OR($C$109=1,$C$109=2,$C$109=3,$C$109=4),1,0)","v":1},{"$f":"C53*I53","v":{"v":0,"d":"0.000"}},{"$f":"D53*I53","v":{"v":0,"d":"0.000"}},{"$f":"G53*I53","v":{"v":0,"d":"0.00"}},{"$f":"H53*I53","v":{"v":0,"d":"0.00"}}]
["Current on configurable I/O (I/Ox)",null,{"$f":"FC360_Panel!F109","v":{"v":0,"d":"0.000"}},{"$f":"FC360_Panel!H109","v":{"v":0,"d":"0.000"}},24,{"v":1,"d":"100%"},{"v":0,"d":"0.00"},{"v":0,"d":"0.00"},{"$f":"$I$53","v":1},{"v":0,"d":"0.000"},{"v":0,"d":"0.000"},{"v":0,"d":"0.00"},{"v":0,"d":"0.00"}]
["Load for external dialer",null,{"$f":"FC360_Panel!F110","v":{"v":0,"d":"0.000"}},{"$f":"FC360_Panel!H110","v":{"v":0,"d":"0.000"}},24,{"v":1,"d":"100%"},{"v":0,"d":"0.00"},{"v":0,"d":"0.00"},{"$f":"$I$53","v":1},{"v":0,"d":"0.000"},{"v":0,"d":"0.000"},{"v":0,"d":"0.00"},{"v":0,"d":"0.00"}]
["Load for FDCIO223",null,{"$f":"FC360_Panel!F111","v":{"v":0,"d":"0.000"}},{"$f":"FC360_Panel!H111","v":{"v":0,"d":"0.000"}},24,{"v":1,"d":"100%"},{"v":0,"d":"0.00"},{"v":0,"d":"0.00"},{"$f":"$I$53","v":1},{"v":0,"d":"0.000"},{"v":0,"d":"0.000"},{"v":0,"d":"0.00"},{"v":0,"d":"0.00"}]
["Load for FT2040",null,{"$f":"FC360_Panel!F112","v":{"v":0,"d":"0.000"}},{"$f":"FC360_Panel!H112","v":{"v":0,"d":"0.000"}},24,{"v":1,"d":"100%"},{"v":0,"d":"0.00"},{"v":0,"d":"0.00"},{"$f":"$I$53","v":1},{"v":0,"d":"0.000"},{"v":0,"d":"0.000"},{"v":0,"d":"0.00"},{"v":0,"d":"0.00"}]
["Load for Scalance X204-2 / S612",null,{"$f":"FC360_Panel!F113","v":{"v":0,"d":"0.000"}},{"$f":"FC360_Panel!H113","v":{"v":0,"d":"0.000"}},24,{"v":1,"d":"100%"},{"v":0,"d":"0.00"},{"v":0,"d":"0.00"},{"$f":"$I$53","v":1},{"v":0,"d":"0.000"},{"v":0,"d":"0.000"},{"v":0,"d":"0.00"},{"v":0,"d":"0.00"}]
[]
[]
["External VSYS supply output 2",null,{"$f":"C$25","v":"I norm [A]"},"I alarm [A]","U [V]","n [%]","P norm [W]","P alarm [W]","Quant. [pcs]","I norm [A]","I alarm [A]","P norm [W]","P alarm [W]"]
["External supply output 2 (VSYS_02)",null,{"$f":"FC360_Panel!F116","v":{"v":0,"d":"0.000"}},{"$f":"FC360_Panel!H116","v":{"v":0,"d":"0.000"}},24,{"$f":"IF(21<E62,IF(E62<30,100%,80%),80%)","v":{"v":1,"d":"100%"}},{"$f":"C62*E62/F62","v":{"v":0,"d":"0.00"}},{"$f":"D62*E62/F62","v":{"v":0,"d":"0.00"}},{"$f":"IF(OR($C$109=2,$C$109=3,$C$109=4),1,0)","v":0},{"$f":"C62*I62","v":{"v":0,"d":"0.000"}},{"$f":"D62*I62","v":{"v":0,"d":"0.000"}},{"$f":"G62*I62","v":{"v":0,"d":"0.00"}},{"$f":"H62*I62","v":{"v":0,"d":"0.00"}}]
["Current on configurable I/O (I/Ox)",null,{"$f":"FC360_Panel!F117","v":{"v":0,"d":"0.000"}},{"$f":"FC360_Panel!H117","v":{"v":0,"d":"0.000"}},24,{"v":1,"d":"100%"},{"v":0,"d":"0.00"},{"v":0,"d":"0.00"},{"$f":"$I$62","v":0},{"v":0,"d":"0.000"},{"v":0,"d":"0.000"},{"v":0,"d":"0.00"},{"v":0,"d":"0.00"}]
["Load for FCA2005",null,{"$f":"FC360_Panel!F118","v":{"v":0,"d":"0.000"}},{"$f":"FC360_Panel!H118","v":{"v":0,"d":"0.000"}},24,{"v":1,"d":"100%"},{"v":0,"d":"0.00"},{"v":0,"d":"0.00"},{"$f":"$I$62","v":0},{"v":0,"d":"0.000"},{"v":0,"d":"0.000"},{"v":0,"d":"0.00"},{"v":0,"d":"0.00"}]
["Load for FDCIO223",null,{"$f":"FC360_Panel!F119","v":{"v":0,"d":"0.000"}},{"$f":"FC360_Panel!H119","v":{"v":0,"d":"0.000"}},24,{"v":1,"d":"100%"},{"v":0,"d":"0.00"},{"v":0,"d":"0.00"},{"$f":"$I$62","v":0},{"v":0,"d":"0.000"},{"v":0,"d":"0.000"},{"v":0,"d":"0.00"},{"v":0,"d":"0.00"}]
["Load for FT2040",null,{"$f":"FC360_Panel!F120","v":{"v":0,"d":"0.000"}},{"$f":"FC360_Panel!H120","v":{"v":0,"d":"0.000"}},24,{"v":1,"d":"100%"},{"v":0,"d":"0.00"},{"v":0,"d":"0.00"},{"$f":"$I$62","v":0},{"v":0,"d":"0.000"},{"v":0,"d":"0.000"},{"v":0,"d":"0.00"},{"v":0,"d":"0.00"}]
["Load for Scalance X204-2 / S612",null,{"$f":"FC360_Panel!F121","v":{"v":0,"d":"0.000"}},{"$f":"FC360_Panel!H121","v":{"v":0,"d":"0.000"}},24,{"v":1,"d":"100%"},{"v":0,"d":"0.00"},{"v":0,"d":"0.00"},{"$f":"$I$62","v":0},{"v":0,"d":"0.000"},{"v":0,"d":"0.000"},{"v":0,"d":"0.00"},{"v":0,"d":"0.00"}]
[]
[{"$nulls":11},{"$f":"L$25","v":"P norm [W]"},{"$f":"M$25","v":"P alarm [W]"}]
["Power consumption (Ex. Periboard)",{"$nulls":10},{"$f":"SUM(L$43:L$67)","v":{"v":0,"d":"0.00"}},{"$f":"SUM(M$43:M$67)","v":{"v":0,"d":"0.00"}}]
[]
["Options"]
["Networking",null,{"$f":"C$25","v":"I norm [A]"},"I alarm [A]","U [V]","n [%]","P norm [W]","P alarm [W]","Quant. [pcs]","I norm [A]","I alarm [A]","P norm [W]","P alarm [W]"]
["1. Vernetzungsmodul (SAFEDLINK)","FN2001-A1 ",{"v":0.04,"d":"0.040"},{"v":0.04,"d":"0.040"},24,{"$f":"IF(21<E74,IF(E74<30,100%,80%),80%)","v":{"v":1,"d":"100%"}},{"$f":"C74*E74/F74","v":0.96},{"$f":"D74*E74/F74","v":0.96},{"$f":"IF($C$109=1,0,IF(FC360_Panel!D132>=1,1,0))","v":0},null,null,{"$f":"I74*$G74","v":{"v":0,"d":"0.00"}},{"$f":"I74*$H74","v":{"v":0,"d":"0.00"}}]
["2. Vernetzungsmodul (SAFEDLINK)","FN2001-A1 ",0.025,0.025,24,{"$f":"IF(21<E75,IF(E75<30,100%,80%),80%)","v":{"v":1,"d":"100%"}},{"$f":"C75*E75/F75","v":{"v":0.6000000000000001,"d":"0.60"}},{"$f":"D75*E75/F75","v":{"v":0.6000000000000001,"d":"0.60"}},{"$f":"IF($C$109=1,0,IF(FC360_Panel!D132>=2,1,0))","v":0},null,null,{"$f":"I75*$G75","v":{"v":0,"d":"0.00"}},{"$f":"I75*$H75","v":{"v":0,"d":"0.00"}}]
["Repeater (SAFEDLINK)","FN2002 ",0.045,0.045,24,{"$f":"IF(21<E76,IF(E76<30,100%,80%),80%)","v":{"v":1,"d":"100%"}},{"$f":"C76*E76/F76","v":1.08},{"$f":"D76*E76/F76","v":1.08},{"$f":"IF($C$109=1,0,IF(FC360_Panel!D133>=1,1,0))","v":0},null,null,{"$f":"I76*$G76","v":{"v":0,"d":"0.00"}},{"$f":"I76*$H76","v":{"v":0,"d":"0.00"}}]
["LWL-Konvertermodul",null,{"v":0.2,"d":"0.200"},{"v":0.2,"d":"0.200"},24,{"$f":"IF(21<E77,IF(E77<30,100%,80%),80%)","v":{"v":1,"d":"100%"}},{"$f":"C77*E77/F77","v":{"v":4.800000000000001,"d":"4.80"}},{"$f":"D77*E77/F77","v":{"v":4.800000000000001,"d":"4.80"}},{"$f":"IF($C$109=1,0,IF(FC360_Panel!D134>=1,1,0))","v":0},null,null,{"$f":"I77*$G77","v":{"v":0,"d":"0.00"}},{"$f":"I77*$H77","v":{"v":0,"d":"0.00"}}]
[]
["Communication"]
["Ethernet connection",null,0.015,0.015,24,{"$f":"IF(21<E80,IF(E80<30,100%,80%),80%)","v":{"v":1,"d":"100%"}},{"$f":"C80*E80/F80","v":0.36},{"$f":"D80*E80/F80","v":0.36},{"$f":"IF(FC360_Panel!D137=\"YES\",1,0)","v":0},null,null,{"$f":"I80*$G80","v":{"v":0,"d":"0.00"}},{"$f":"I80*$H80","v":{"v":0,"d":"0.00"}},null,"YES","NO"]
["No module","-",{"v":0,"d":"0.000"},{"v":0,"d":"0.000"},0,{"v":0,"d":"0%"},{"v":0,"d":"0.00"},{"v":0,"d":"0.00"},0,null,null,{"$f":"I81*$G81","v":{"v":0,"d":"0.00"}},{"$f":"I81*$H81","v":{"v":0,"d":"0.00"}}]
["RS232 module (isolated)","FCA2001-A1",0.065,0.065,3.3,{"$f":"IF(21<E82,IF(E82<30,100%,80%),80%)","v":{"v":0.8,"d":"80%"}},{"$f":"C82*E82/F82","v":{"v":0.268125,"d":"0.27"}},{"$f":"D82*E82/F82","v":{"v":0.268125,"d":"0.27"}},{"$f":"IF(FC360_Panel!D138=\"RS232 module (isolated)\",1,0)","v":0},null,null,{"$f":"I82*$G82","v":{"v":0,"d":"0.00"}},{"$f":"I82*$H82","v":{"v":0,"d":"0.00"}}]
["RS485 module (isolated)","FCA2002-A1 ",0.065,0.065,3.3,{"$f":"IF(21<E83,IF(E83<30,100%,80%),80%)","v":{"v":0.8,"d":"80%"}},{"$f":"C83*E83/F83","v":{"v":0.268125,"d":"0.27"}},{"$f":"D83*E83/F83","v":{"v":0.268125,"d":"0.27"}},{"$f":"IF(FC360_Panel!D138=\"RS485 module (isolated)\",1,0)","v":0},null,null,{"$f":"I83*$G83","v":{"v":0,"d":"0.00"}},{"$f":"I83*$H83","v":{"v":0,"d":"0.00"}}]
["Printer"]
["Event printer","FTO2002-A1",{"$f":"FC360_Panel!F142","v":{"v":0.05,"d":"0.050"}},{"$f":"FC360_Panel!H142","v":{"v":0.06,"d":"0.060"}},24,{"$f":"IF(21<E85,IF(E85<30,100%,80%),80%)","v":{"v":1,"d":"100%"}},{"$f":"C85*E85/F85","v":{"v":1.2000000000000002,"d":"1.20"}},{"$f":"D85*E85/F85","v":1.44},{"$f":"IF($C$109=1,0,FC360_Panel!D142)","v":0},null,null,{"$f":"I85*$G85","v":{"v":0,"d":"0.00"}},{"$f":"I85*$H85","v":{"v":0,"d":"0.00"}}]
[]
["Fire department periphery mod."]
["Feuerwehrperipherie-Modul","FCI2001-D1 ",0.058,0.062,24,{"$f":"IF(21<E88,IF(E88<30,100%,80%),80%)","v":{"v":1,"d":"100%"}},{"$f":"C88*E88/F88","v":{"v":1.3920000000000001,"d":"1.39"}},{"$f":"D88*E88/F88","v":{"v":1.488,"d":"1.49"}},{"$f":"IF(OR($C$109=1,$C$109=5),0,FC360_Panel!D146)","v":0},{"$f":"I88*C88","v":{"v":0,"d":"0.000"}},{"$f":"I88*D88","v":{"v":0,"d":"0.000"}},{"$f":"I88*$G88","v":{"v":0,"d":"0.00"}},{"$f":"I88*$H88","v":{"v":0,"d":"0.00"}}]
["FBF",null,{"$f":"FC360_Panel!F147","v":{"v":0,"d":"0.000"}},{"$f":"FC360_Panel!H147","v":{"v":0,"d":"0.000"}},24,{"v":1,"d":"100%"},{"v":0,"d":"0.00"},{"v":0,"d":"0.00"},{"$f":"I$88","v":0},null,null,{"v":0,"d":"0.00"},{"v":0,"d":"0.00"}]
["UeE",null,{"$f":"FC360_Panel!F148","v":{"v":0,"d":"0.000"}},{"$f":"FC360_Panel!H148","v":{"v":0,"d":"0.000"}},24,{"v":1,"d":"100%"},{"v":0,"d":"0.00"},{"v":0,"d":"0.00"},{"$f":"I$88","v":0},null,null,{"v":0,"d":"0.00"},{"v":0,"d":"0.00"}]
["FSD",null,{"$f":"FC360_Panel!F149","v":{"v":0,"d":"0.000"}},{"$f":"FC360_Panel!H149","v":{"v":0,"d":"0.000"}},24,{"v":1,"d":"100%"},{"v":0,"d":"0.00"},{"v":0,"d":"0.00"},{"$f":"I$88","v":0},null,null,{"v":0,"d":"0.00"},{"v":0,"d":"0.00"}]
["Kennleuchte",null,{"$f":"FC360_Panel!F150","v":{"v":0,"d":"0.000"}},{"$f":"FC360_Panel!H150","v":{"v":0,"d":"0.000"}},24,{"v":1,"d":"100%"},{"v":0,"d":"0.00"},{"v":0,"d":"0.00"},{"$f":"I$88","v":0},null,null,{"v":0,"d":"0.00"},{"v":0,"d":"0.00"}]
["FSE",null,{"$f":"FC360_Panel!F151","v":{"v":0,"d":"0.000"}},{"$f":"FC360_Panel!H151","v":{"v":0,"d":"0.000"}},24,{"v":1,"d":"100%"},{"v":0,"d":"0.00"},{"v":0,"d":"0.00"},{"$f":"I$88","v":0},null,null,{"v":0,"d":"0.00"},{"v":0,"d":"0.00"}]
[]
[]
["PMI-Options"]
["No module","-",{"v":0,"d":"0.000"},{"v":0,"d":"0.000"},0,{"v":0,"d":"0%"},{"v":0,"d":"0.00"},{"v":0,"d":"0.00"},{"$f":"IF(FC360_Panel!D156=\"LED indicators(16 Zone)\",1,0)","v":0},null,null,{"$f":"I97*$G97","v":{"v":0,"d":"0.00"}},{"$f":"I97*$H97","v":{"v":0,"d":"0.00"}},null,"-"]
["LED indicators(32 Zone)","FTO3603-Z1",0.004,{"v":0.06,"d":"0.060"},24,{"$f":"IF(21<E98,IF(E98<30,100%,80%),80%)","v":{"v":1,"d":"100%"}},{"v":0,"d":"0.00"},0.72,{"$f":"IF(FC360_Panel!D156=\"LED indicators(32 Zone)\",1,0)","v":0},null,null,{"$f":"I98*$G98","v":{"v":0,"d":"0.00"}},{"$f":"I98*$H98","v":{"v":0,"d":"0.00"}},null,"32-zone LED indicator add-on"]
["Evacuation module(NL)","FTO3601-H1",{"v":0,"d":"0.000"},0.009,24,{"$f":"IF(21<E99,IF(E99<30,100%,80%),80%)","v":{"v":1,"d":"100%"}},{"$f":"2*C99*E99/F99","v":{"v":0,"d":"0.00"}},{"$f":"2*D99*E99/F99","v":{"v":0.43199999999999994,"d":"0.43"}},{"$f":"IF(FC360_Panel!D156=\"Evacuation module(NL)\",1,0)","v":0},null,null,{"$f":"I99*$G99","v":{"v":0,"d":"0.00"}},{"$f":"I99*$H99","v":{"v":0,"d":"0.00"}},null,"EVAC indicator add-on"]
["Output card (4M)"]
["Output card (4M)","FCA3602-Z1 ",0.011,0.063,24,{"$f":"IF(21<E101,IF(E101<30,100%,80%),80%)","v":{"v":1,"d":"100%"}},{"$f":"C101*E101/F101","v":{"v":0.264,"d":"0.26"}},{"$f":"D101*E101/F101","v":{"v":1.512,"d":"1.51"}},{"$f":"FC360_Panel!D174*FC360_Panel!D179","v":0},{"$f":"I101*C101","v":{"v":0,"d":"0.000"}},{"$f":"I101*D101","v":{"v":0,"d":"0.000"}},{"$f":"I101*$G101","v":{"v":0,"d":"0.00"}},{"$f":"I101*$H101","v":{"v":0,"d":"0.00"}}]
["Output 1",{"$f":"FC360_Panel!D162","v":"RT-Fault"},{"$f":"FC360_Panel!F162","v":{"v":0,"d":"0.000"}},{"$f":" FC360_Panel!H162","v":{"v":0,"d":"0.000"}},26.1,{"$f":"IF(21<E102,IF(E102<30,100%,80%),80%)","v":{"v":1,"d":"100%"}},{"$f":"C102*E102/F102","v":{"v":0,"d":"0.00"}},{"$f":"D102*E102/F102","v":{"v":0,"d":"0.00"}},1,null,null,{"$f":"I102*$G102","v":{"v":0,"d":"0.00"}},{"$f":"I102*$H102","v":{"v":0,"d":"0.00"}}]
["Output 2",{"$f":"FC360_Panel!D163","v":"RT-Fire"},{"$f":"FC360_Panel!F163","v":{"v":0,"d":"0.000"}},{"$f":" FC360_Panel!H163","v":{"v":0,"d":"0.000"}},26.1,{"$f":"IF(21<E103,IF(E103<30,100%,80%),80%)","v":{"v":1,"d":"100%"}},{"$f":"C103*E103/F103","v":{"v":0,"d":"0.00"}},{"$f":"D103*E103/F103","v":{"v":0,"d":"0.00"}},1,null,null,{"$f":"I103*$G103","v":{"v":0,"d":"0.00"}},{"$f":"I103*$H103","v":{"v":0,"d":"0.00"}}]
["Output 3",{"$f":"FC360_Panel!D164","v":"Fire Control"},{"$f":"FC360_Panel!F164","v":{"v":0,"d":"0.000"}},{"$f":" FC360_Panel!H164","v":{"v":0,"d":"0.000"}},26.1,{"$f":"IF(21<E104,IF(E104<30,100%,80%),80%)","v":{"v":1,"d":"100%"}},{"$f":"C104*E104/F104","v":{"v":0,"d":"0.00"}},{"$f":"D104*E104/F104","v":{"v":0,"d":"0.00"}},1,null,null,{"$f":"I104*$G104","v":{"v":0,"d":"0.00"}},{"$f":"I104*$H104","v":{"v":0,"d":"0.00"}}]
["Output 4",{"$f":"FC360_Panel!D165","v":"Sounder Line"},{"$f":"FC360_Panel!F165","v":{"v":0,"d":"0.000"}},{"$f":" FC360_Panel!H165","v":{"v":0,"d":"0.000"}},26.1,{"$f":"IF(21<E105,IF(E105<30,100%,80%),80%)","v":{"v":1,"d":"100%"}},{"$f":"C105*E105/F105","v":{"v":0,"d":"0.00"}},{"$f":"D105*E105/F105","v":{"v":0,"d":"0.00"}},1,null,null,{"$f":"I105*$G105","v":{"v":0,"d":"0.00"}},{"$f":"I105*$H105","v":{"v":0,"d":"0.00"}}]
["Power consumption (Ex. Options)",{"$nulls":10},{"$f":"L$25","v":"P norm [W]"},{"$f":"M$25","v":"P alarm [W]"},"RT-Falt [w]"]
[{"$nulls":11},{"$f":"SUM(L$74:L$105)","v":{"v":0,"d":"0.00"}},{"$f":"SUM(M$74:M$105)","v":{"v":0,"d":"0.00"}},{"$f":"SUM(IF(B102=\"RT-Fault\",L102,0),IF(B103=\"RT-Fault\",L103,0),IF(B104=\"RT-Fault\",L104,0),IF(B105=\"RT-Fault\",L105,0))","v":{"v":0,"d":"0.00"}}]
["Panel"]
["Panel type:",{"$f":"VLOOKUP(C109,Panel_values!A3:L8,_xlfn.SINGLE(D109)+1,FALSE)","v":"FC361-ZZ"},{"$f":"FC360_Panel!$E$41","v":1},{"$f":"FC360_Panel!$E$56","v":1}]
["Periphery board type",{"$f":"IF(B109=\"--\",\"--\",VLOOKUP(C109,Panel_values!A58:E63,2,FALSE))","v":"C-NET"},{"$f":"IF(B110=\"--\",\"\",IF($C$109=1,1,IF($C$109=2,2,IF(OR($C$109=3,$C$109=4),4,0))))","v":1},{"$f":"IF(B110=\"--\",\"\",\"loops\")","v":"loops"}]
["Card cage type",{"$f":"IF(B109=\"--\",\"--\",VLOOKUP(C109,Panel_values!A58:E63,3,FALSE))","v":"--"},{"$f":"IF(B111=\"--\",\"\",IF($C$109=2,2,IF($C$109=4,5,0)))","v":""},{"$f":"IF(B111=\"--\",\"\",\"slots\")","v":""}]
[]
["Own consumption",null,{"$f":"C$25","v":"I norm [A]"},"I alarm [A]","U [V]","n [%]","P norm [W]","P alarm [W]","Quant. [pcs]","I norm [A]","I alarm [A]","P norm [W]","P alarm [W]"]
["PMI- & Mainboard (inkl. CPU)",null,{"v":0.0905,"d":"0.091"},{"v":0.1105,"d":"0.111"},24,{"$f":"IF(21<E114,IF(E114<30,100%,80%),80%)","v":{"v":1,"d":"100%"}},{"$f":"C114*E114/F114","v":{"v":2.1719999999999997,"d":"2.17"}},{"$f":"D114*E114/F114","v":{"v":2.652,"d":"2.65"}}]
["Complete PMI & Mainboard","FCM2004",{"$nulls":4},{"$f":"SUM(G114:G114)","v":{"v":2.1719999999999997,"d":"2.17"}},{"$f":"SUM(H114:H114)","v":{"v":2.652,"d":"2.65"}},1,null,null,{"$f":"I115*G115","v":{"v":2.1719999999999997,"d":"2.17"}},{"$f":"I115*H115","v":{"v":2.652,"d":"2.65"}}]
[]
["1st CPU CARD","FCC2004",{"v":0.14,"d":"0.140"},{"v":0.14,"d":"0.140"},24,{"$f":"IF(21<E117,IF(E117<30,100%,80%),80%)","v":{"v":1,"d":"100%"}},{"$f":"C117*E117/F117","v":{"v":3.3600000000000003,"d":"3.36"}},{"$f":"D117*E117/F117","v":{"v":3.3600000000000003,"d":"3.36"}}]
["2st CPU CARD","FCC2004",{"v":0.14,"d":"0.140"},{"v":0.14,"d":"0.140"},24,{"$f":"IF(21<E118,IF(E118<30,100%,80%),80%)","v":{"v":1,"d":"100%"}},{"$f":"C118*E118/F118","v":{"v":3.3600000000000003,"d":"3.36"}},{"$f":"D118*E118/F118","v":{"v":3.3600000000000003,"d":"3.36"}}]
["Communication Card","FCC2005",{"v":0.03,"d":"0.030"},{"v":0.03,"d":"0.030"},24,{"$f":"IF(21<E119,IF(E119<30,100%,80%),80%)","v":{"v":1,"d":"100%"}},{"$f":"C119*E119/F119","v":0.72},{"$f":"D119*E119/F119","v":0.72}]
["Complete CPU card cage",{"$nulls":5},{"$f":"SUM(G117:G119)","v":7.44},{"$f":"SUM(H117:H119)","v":7.44},{"$f":"IF($C$109=6,1,0)","v":0},null,null,{"$f":"I120*G120","v":{"v":0,"d":"0.00"}},{"$f":"I120*H120","v":{"v":0,"d":"0.00"}}]
[]
["LED indicator (internal)","FTO2002-A1",0.004,{"v":0.07,"d":"0.070"},24,{"$f":"IF(21<E122,IF(E122<30,100%,80%),80%)","v":{"v":1,"d":"100%"}},{"$f":"C122*E122/F122","v":{"v":0.096,"d":"0.10"}},{"$f":"D122*E122/F122","v":{"v":1.6800000000000002,"d":"1.68"}},{"$f":"VLOOKUP(C109,Panel_values!A31:L36,_xlfn.SINGLE(D109)+1,FALSE)","v":0},null,null,{"$f":"I122*G122","v":{"v":0,"d":"0.00"}},{"$f":"I122*H122","v":{"v":0,"d":"0.00"}}]
["FBA-CH operating unit","FTO2004-C1",0.015,{"v":0.03,"d":"0.030"},24,{"$f":"IF(21<E123,IF(E123<30,100%,80%),80%)","v":{"v":1,"d":"100%"}},{"$f":"C123*E123/F123","v":0.36},{"$f":"D123*E123/F123","v":0.72},{"$f":"VLOOKUP(C109,Panel_values!A40:L45,_xlfn.SINGLE(D109)+1,FALSE)","v":0},null,null,{"$f":"I123*G123","v":{"v":0,"d":"0.00"}},{"$f":"I123*H123","v":{"v":0,"d":"0.00"}}]
["EVAC-NL operating unit","FTO2007-N1",0.006,{"v":0.03,"d":"0.030"},24,{"$f":"IF(21<E124,IF(E124<30,100%,80%),80%)","v":{"v":1,"d":"100%"}},{"$f":"C124*E124/F124","v":{"v":0.14400000000000002,"d":"0.14"}},{"$f":"D124*E124/F124","v":0.72},{"$f":"VLOOKUP(C109,Panel_values!A49:L54,_xlfn.SINGLE(D109)+1,FALSE)","v":0},null,null,{"$f":"I124*G124","v":{"v":0,"d":"0.00"}},{"$f":"I124*H124","v":{"v":0,"d":"0.00"}}]
[]
["Peripheral board (2-loop)",null,{"v":0.0027,"d":"0.003"},{"v":0.0027,"d":"0.003"},24,{"$f":"IF(21<E126,IF(E126<30,100%,80%),80%)","v":{"v":1,"d":"100%"}},{"$f":"C126*E126/F126","v":{"v":0.0648,"d":"0.06"}},{"$f":"D126*E126/F126","v":{"v":0.0648,"d":"0.06"}}]
["P2 UART (--> sheet calculation_C-NET_x)"]
["Complete Peripheral Board  2-L","FCI2010/02",{"$nulls":4},{"$f":"SUM(G126:G127)","v":{"v":0.0648,"d":"0.06"}},{"$f":"SUM(H126:H127)","v":{"v":0.0648,"d":"0.06"}},{"$f":"IF(OR($C$109=1,$C$109=2),1,0)","v":1},null,null,{"$f":"I128*G128","v":{"v":0.0648,"d":"0.06"}},{"$f":"I128*H128","v":{"v":0.0648,"d":"0.06"}}]
[]
["Peripheral board (4-loop)",null,{"$f":"0.133-(2*0.04)","v":{"v":0.053000000000000005,"d":"0.053"}},{"$f":"0.183-(2*0.04)","v":0.103},24,{"$f":"IF(21<E130,IF(E130<30,100%,80%),80%)","v":{"v":1,"d":"100%"}},{"$f":"C130*E130/F130","v":{"v":1.2720000000000002,"d":"1.27"}},{"$f":"D130*E130/F130","v":{"v":2.472,"d":"2.47"}}]
["P2 UART (--> sheet calculation_C-NET_x)"]
["Complete Peripheral Board 4-L","FCI2004",{"$nulls":4},{"$f":"SUM(G130:G131)","v":{"v":1.2720000000000002,"d":"1.27"}},{"$f":"SUM(H130:H131)","v":{"v":2.472,"d":"2.47"}},{"$f":"IF(OR($C$109=3,$C$109=4),1,0)","v":0},null,null,{"$f":"I132*G132","v":{"v":0,"d":"0.00"}},{"$f":"I132*H132","v":{"v":0,"d":"0.00"}}]
[]
["Peripheral Board T",null,{"v":0.01,"d":"0.010"},{"v":0.01,"d":"0.010"},24,{"$f":"IF(21<E134,IF(E134<30,100%,80%),80%)","v":{"v":1,"d":"100%"}},{"$f":"C134*E134/F134","v":0.24},{"$f":"D134*E134/F134","v":0.24}]
["Complete Peripheral Board T","FTI2001",{"$nulls":4},{"$f":"SUM(G134)","v":0.24},{"$f":"SUM(H134)","v":0.24},{"$f":"IF($C$109=5,1,0)","v":0},null,null,{"$f":"I135*G135","v":{"v":0,"d":"0.00"}},{"$f":"I135*H135","v":{"v":0,"d":"0.00"}}]
["Second P2 loop",null,0.003,0.003,24,{"$nulls":6},{"$f":"IF(C109=2, C136*E136,0)","v":{"v":0,"d":"0.000"}},{"$f":"IF(C109=2, D136*E136,0)","v":{"v":0,"d":"0.00"}}]
[{"$nulls":11},{"$f":"L$25","v":"P norm [W]"},{"$f":"M$25","v":"P alarm [W]"}]
["Power consumption (own)",null,{"$f":"L138/E138","v":{"v":0.09319999999999999,"d":"0.093"}},{"$f":"M138/E138","v":{"v":0.11320000000000001,"d":"0.113"}},24,{"$nulls":6},{"$f":"SUM(L115:L136)","v":{"v":2.2367999999999997,"d":"2.24"}},{"$f":"SUM(M115:M136)","v":{"v":2.7168,"d":"2.72"}}]
[]
["I2C check","Total","PMI","Perib","PMI-Opt"]
["Number of I2C participants",{"$f":"SUM(C141:E141)","v":4},3,1,{"$f":"I98+2*I99+SUM(I122:I124)","v":0}]
[]
["Supply 1: Power calculation"]
["Power calculation",{"$nulls":8},{"$f":"J$25","v":"I norm [A]"},{"$f":"K$25","v":"I alarm [A]"},{"$f":"L$25","v":"P norm [W]"},{"$f":"M$25","v":"P alarm [W]"}]
["Field devices",{"$nulls":8},{"$f":"L145/24","v":0.039},0.039,{"$f":"IF($B$109=\"--\",0,L32)","v":{"v":0.9359999999999999,"d":"0.94"}},{"$f":"IF($B$109=\"--\",0,M32)","v":{"v":0.9359999999999999,"d":"0.94"}}]
["Card cages with supply 1",{"$nulls":8},{"$f":"L146/24","v":{"v":0,"d":"0.000"}},{"$f":"M146/24","v":{"v":0,"d":"0.000"}},{"$f":"IF($B$109=\"--\",0,L39)","v":{"v":0,"d":"0.00"}},{"$f":"IF($B$109=\"--\",0,M39)","v":{"v":0,"d":"0.00"}}]
["Input / Outputs",{"$nulls":8},{"v":0,"d":"0.000"},{"v":0,"d":"0.000"},{"$f":"IF($B$109=\"--\",0,L70)","v":{"v":0,"d":"0.00"}},{"$f":"IF($B$109=\"--\",0,M70)","v":{"v":0,"d":"0.00"}}]
["Options",{"$nulls":8},{"$f":"L148/24","v":{"v":0,"d":"0.000"}},{"v":0,"d":"0.000"},{"$f":"IF($B$109=\"--\",0,L107)","v":{"v":0,"d":"0.00"}},{"$f":"IF($B$109=\"--\",0,M107)","v":{"v":0,"d":"0.00"}}]
["Panel",{"$nulls":8},{"v":0.09319999999999999,"d":"0.093"},{"v":0.11320000000000001,"d":"0.113"},{"$f":"IF($B$109=\"--\",0,L138)","v":{"v":2.2367999999999997,"d":"2.24"}},{"$f":"IF($B$109=\"--\",0,M138)","v":{"v":2.7168,"d":"2.72"}}]
[]
[{"$nulls":9},{"$f":"J$25","v":"I norm [A]"},{"$f":"K$25","v":"I alarm [A]"},{"$f":"L$25","v":"P norm [W]"},{"$f":"M$25","v":"P alarm [W]"}]
["Total",{"$nulls":8},{"$f":"L152/24","v":{"v":0.13219999999999998,"d":"0.132"}},{"$f":"M152/24","v":{"v":0.1522,"d":"0.152"}},{"$f":"SUM(L145:L149)","v":{"v":3.1727999999999996,"d":"3.17"}},{"$f":"SUM(M145:M149)","v":{"v":3.6528,"d":"3.65"}}]
[]
["Supply 2: Power calculation"]
["Power calculation",{"$nulls":8},{"$f":"J$25","v":"I norm [A]"},{"$f":"K$25","v":"I alarm [A]"},{"$f":"L$25","v":"P norm [W]"},{"$f":"M$25","v":"P alarm [W]"}]
["Card cages with supply 2",{"$nulls":8},{"$f":"L156/24","v":{"v":0,"d":"0.000"}},{"$f":"M156/24","v":{"v":0,"d":"0.000"}},{"v":0,"d":"0.00"},{"v":0,"d":"0.00"}]
[]
["Supply 3: Power calculation"]
["Power calculation",{"$nulls":8},{"$f":"J$25","v":"I norm [A]"},{"$f":"K$25","v":"I alarm [A]"},{"$f":"L$25","v":"P norm [W]"},{"$f":"M$25","v":"P alarm [W]"}]
["Card cages with supply 3",{"$nulls":8},{"$f":"L160/24","v":{"v":0,"d":"0.000"}},{"$f":"M160/24","v":{"v":0,"d":"0.000"}},{"v":0,"d":"0.00"},{"v":0,"d":"0.00"}]
[]
["Battery standby-time"]
[]
["Required standby-time",null,{"$f":"FC360_Panel!D224","v":24},"h"]
["Required alarm-time (after standby)",null,{"$f":"FC360_Panel!D225","v":0.5},"h"]
[]
["Supply & Battery check for Supply1"]
[]
["Nominal required battery",null,{"$f":"$J$152*0.5+$K$152*$C$165+($J$152-N107/24)*($C$164-0.5)","v":{"v":3.2488999999999995,"d":"3.25"}},"Ah"]
["Security factor",null,{"$f":"VLOOKUP($C$164,$B$221:$C$225,2,TRUE)","v":1.25}]
["Required battery",null,{"$f":"C169*C170","v":{"v":4.061125,"d":"4.06"}},"Ah"]
["Available battery",{"$f":"VLOOKUP(C171,$E$221:$H$229,3,TRUE)","v":"FA2003-A1"},{"$f":"IF(C171=0,0,VLOOKUP(C171,$E$221:$H$229,2,TRUE))","v":7},"Ah",{"$f":"VLOOKUP(C171,$E$221:$H$228,4,TRUE)","v":"A5Q00019353"}]
["Housing type:",null,{"$f":"VLOOKUP($C$109,Panel_values!$A$85:$L$90,_xlfn.SINGLE(Panel_comp!$D$109)+1,FALSE)","v":"Compact"}]
["Max. fitting batteries",{"$f":"VLOOKUP(C174,$F$221:$H$229,2,TRUE)","v":"FA2004-A1"},{"$f":"VLOOKUP($C$109,Panel_values!$A$94:$L$100,_xlfn.SINGLE($D$109)+1,FALSE)","v":12},"Ah",{"$f":"VLOOKUP(C174,$F$221:$H$228,3,TRUE)","v":"A5Q00019354"}]
["Battery check code",null,{"$f":"FC360_Panel!I246","v":3}]
[]
[]
["Supply calculation"]
["Battery load current for available type",null,{"$f":"IF(C172=\"no\",0,C172/20)","v":{"v":0.35,"d":"0.350"}},"A"]
["Max. current for power supply",null,{"$f":"MAX($J$152*1.1+C179,$K$152*1.1)","v":{"v":0.49541999999999997,"d":"0.495"}},"A"]
["Required power supply",null,{"$f":"C180*24","v":{"v":11.89008,"d":"12"}},"W"]
["Delivered power supply",{"$f":"VLOOKUP(C182,$G$234:$I$238,2,TRUE)","v":"FP2001-A1"},{"$f":"VLOOKUP($C$109,Panel_values!$A$67:$L$72,_xlfn.SINGLE($D$109)+1,FALSE)","v":70},"W",{"$f":"VLOOKUP(C182,$G$234:$I$238,3,TRUE)","v":"see docu"}]
["Available power supply",{"$f":"VLOOKUP(C183,$G$234:$I$238,2,TRUE)","v":"FP2001-A1"},{"$f":"VLOOKUP(C180,$E$234:$I$239,3,TRUE)","v":70},"W",{"$f":"VLOOKUP(C183,$G$234:$I$238,3,TRUE)","v":"see docu"}]
["Housing type:",null,{"$f":"C173","v":"Compact"}]
["Max. fitting supply",{"$f":"VLOOKUP(C185,$G$234:$I$238,2,TRUE)","v":"FP2001-A1"},{"$f":"VLOOKUP($C$109,Panel_values!$A$76:$L$81,_xlfn.SINGLE($D$109)+1,FALSE)","v":70},"W",{"$f":"VLOOKUP(C185,$G$234:$I$238,3,TRUE)","v":"see docu"}]
["Supply check code",null,{"$f":"FC360_Panel!I249","v":3}]
[]
[]
["Supply & Battery check for Supply2"]
[]
["Nominal required battery",null,{"$f":"$J$156*$C$164+$K$156*$C$165","v":{"v":0,"d":"0.00"}},"Ah"]
["Security factor",null,{"$f":"VLOOKUP($C$164,$B$221:$C$225,2,TRUE)","v":1.25}]
["Required battery",null,{"$f":"C191*C192","v":{"v":0,"d":"0.00"}},"Ah"]
["Available battery",{"$f":"VLOOKUP(C193,$E$221:$H$229,3,TRUE)","v":"--"},{"$f":"IF(C193=0,0,VLOOKUP(C193,$E$221:$H$229,2,TRUE))","v":0},"Ah",{"$f":"VLOOKUP(C193,$E$221:$H$228,4,TRUE)","v":""}]
[]
[]
["Supply calculation"]
["Battery load current for available type",null,{"$f":"IF(C194=\"no\",0,C194/10)","v":{"v":0,"d":"0.000"}},"A"]
["Max. current for power supply",null,{"$f":"MAX($J$156*1.1+C198,$K$156*1.1)","v":{"v":0,"d":"0.000"}},"A"]
["Required power supply",null,{"$f":"C199*24","v":0},"W"]
["Available power supply",{"$f":"VLOOKUP(C201,$G$234:$I$238,2,TRUE)","v":"--"},{"$f":"VLOOKUP(C199,$E$234:$I$239,3,TRUE)","v":"--"},"W",{"$f":"VLOOKUP(C201,$G$234:$I$238,3,TRUE)","v":""}]
[]
["Supply & Battery check for Supply3"]
[]
["Nominal required battery",null,{"$f":"$J$160*$C$164+$K$160*$C$165","v":{"v":0,"d":"0.00"}},"Ah"]
["Security factor",null,{"$f":"VLOOKUP($C$164,$B$221:$C$225,2,TRUE)","v":1.25}]
["Required battery",null,{"$f":"C205*C206","v":{"v":0,"d":"0.00"}},"Ah"]
["Available battery",{"$f":"VLOOKUP(C207,$E$221:$H$229,3,TRUE)","v":"--"},{"$f":"IF(C207=0,0,VLOOKUP(C207,$E$221:$H$229,2,TRUE))","v":0},"Ah",{"$f":"VLOOKUP(C207,$E$221:$H$228,4,TRUE)","v":""}]
[]
[]
["Supply calculation"]
["Battery load current for available type",null,{"$f":"IF(C208=\"no\",0,C208/10)","v":{"v":0,"d":"0.000"}},"A"]
["Max. current for power supply",null,{"$f":"MAX($J$160*1.1+C212,$K$160*1.1)","v":{"v":0,"d":"0.000"}},"A"]
["Required power supply",null,{"$f":"C213*24","v":0},"W"]
["Available power supply",{"$f":"VLOOKUP(C215,$G$234:$I$238,2,TRUE)","v":"--"},{"$f":"VLOOKUP(C213,$E$234:$I$239,3,TRUE)","v":"--"},"W",{"$f":"VLOOKUP(C215,$G$234:$I$238,3,TRUE)","v":""}]
[]
["Table for supplys and battery checks"]
[]
[null,"Security factor table",null,null,"Table of available batteries",{"$nulls":5},"Table of failure messages"]
[null,"t [h]","f [1]",null,"[Ah]","[Ah]","[Type]","Mat. Nr.",null,null,0,"Use bigger battery & additional housing"]
[null,0,{"$f":"1.25*1.1","v":1.375},null,{"v":0,"d":"0.0"},"--","--","",null,null,1,"Use bigger battery"]
[null,12.1,1.25,null,{"v":1E-4,"d":"0.0001"},7,"FA2003-A1","A5Q00019353",null,null,2,"Use additional housing"]
[null,24.1,1,null,{"v":7,"d":"7.0"},12,"FA2004-A1","A5Q00019354",null,null,3,"O.K."]
[null,30.1,1,null,{"v":12,"d":"12.0"},25,"BAT12-25","S54302-Z102-A1"]
[null,72.1,1,null,{"v":25,"d":"25.0"},"no","--","--"]
[]
[]
[]
[]
[]
[]
[{"$nulls":4},"Power supply table",{"$nulls":5},"Table of failure messages"]
[{"$nulls":4},"I, [A]","I, [A]","[W]","[Type]","Mat. Nr.",null,0,"Use additional supply & additional housing"]
[{"$nulls":4},{"v":0,"d":"0.000"},{"v":0,"d":"0.000"},"--","--","",null,1,"Use additional supply"]
[{"$nulls":4},{"v":1E-4,"d":"0.0001"},{"$f":"G235/24","v":{"v":2.9166666666666665,"d":"2.917"}},70,"FP2001-A1","see docu",null,2,"Use additional housing"]
[{"$nulls":4},{"$f":"F235+0.001","v":{"v":2.9176666666666664,"d":"2.918"}},{"$f":"G236/24","v":{"v":6.25,"d":"6.250"}},150,"SV 24V-150W","see docu",null,3,"O.K."]
[{"$nulls":4},{"$f":"F236+0.001","v":6.251},{"$f":"G237/24","v":{"v":12.5,"d":"12.500"}},300,"2x SV 24V-150W","see docu"]
[{"$nulls":4},{"$f":"F237+0.001","v":12.501},{"$f":"G238/24","v":{"v":18.75,"d":"18.750"}},450,"3x SV 24V-150W","see docu"]
[{"$nulls":4},{"$f":"F238+0.001","v":18.751},null,"--","--","--"]